Zinc, bis(dipentylcarbamodithioato-S,S')-, (T-4)-

Phase change data

Data compiled by: William E. Acree, Jr., James S. Chickos

Quantity Value Units Method Reference Comment
Δsub127. ± 3.kJ/molDSC,ESales, Souza, et al., 2000

References

Sales, Souza, et al., 2000
Sales, José Almir de A. Imeida; Souza, Antonio Gouveia; de Freitas, Geraldo Fernando Gonçalves; Prasad, Shiva; Trindade, Maria de Fátima Severo; Carvalho, Laura Helker; Dunstan, Pedro Oliver, Thermochemistry of adducts of zinc(II) dialkyldithiocarbamate with 2,2´-bipyridine, Thermochimica Acta, 2000, 356, 1-2, 9-17, https://doi.org/10.1016/S0040-6031(00)00497-4 . [all data]