9H-Fluorene-9-carbonitrile

Gas phase ion energetics data

Data compiled by: John E. Bartmess

De-protonation reactions

C14H8N- + Hydrogen cation = 9H-Fluorene-9-carbonitrile

By formula: C14H8N- + H+ = C14H9N

Quantity Value Units Method Reference Comment
Δr1345. ± 8.4kJ/molIMREKoppel, Koppel, et al., 2000gas phase

References

Koppel, Koppel, et al., 2000
Koppel, I.A.; Koppel, J.; Pihl, V.; Leito, I.; Mishima, M.; Vlasov, V.M.; Yagupolskii, L.M.; Taft, R.W., Comparison of Bronsted acidities of neutral CH acids in gas phase and dimethyl sulfoxide, J. Chem. Soc. Perkin Trans., 2000, 2, 6, 1125-1133, https://doi.org/10.1039/b001792m . [all data]