O,O,O-Trimethyl thiophosphate

Gas phase ion energetics data

Data evaluated as indicated in comments:
HL - Edward P. Hunter and Sharon G. Lias

Data compiled as indicated in comments:
LLK - Sharon G. Lias, Rhoda D. Levin, and Sherif A. Kafafi

Quantity Value Units Method Reference Comment
Proton affinity (review)883.6kJ/molN/AHunter and Lias, 1998HL
Quantity Value Units Method Reference Comment
Gas basicity853.9kJ/molN/AHunter and Lias, 1998HL

Ionization energy determinations

IE (eV) Method Reference Comment
9.16PECowley, Lattman, et al., 1977Vertical value; LLK

References

Hunter and Lias, 1998
Hunter, E.P.; Lias, S.G., Evaluated Gas Phase Basicities and Proton Affinities of Molecules: An Update, J. Phys. Chem. Ref. Data, 1998, 27, 3, 413-656, https://doi.org/10.1063/1.556018 . [all data]

Cowley, Lattman, et al., 1977
Cowley, A.H.; Lattman, M.; Montag, R.A.; Verkade, J.G., The coordination behavior of acyclic phosphites; a UV photoelectron spectroscopic study, Inorg. Chim. Acta, 1977, 25, 151. [all data]