Tritium

Gas phase ion energetics data

Data compiled by: Henry M. Rosenstock, Keith Draxl, Bruce W. Steiner, and John T. Herron

Ionization energy determinations

IE (eV) Method Reference
13.603SGarcia and Mack, 1965

References

Garcia and Mack, 1965
Garcia, J.D.; Mack, J.E., Energy level and line tables for one-electron atomic spectra, J. Opt. Soc. Am., 1965, 55, 654. [all data]