Iron, hexacarbonylbis[μ-(diphenylphosphino)]di-

Gas phase ion energetics data

Data compiled by: Henry M. Rosenstock, Keith Draxl, Bruce W. Steiner, and John T. Herron

Ionization energy determinations

IE (eV) Method Reference
7.70 ± 0.03EIJunk, Preston, et al., 1970

References

Junk, Preston, et al., 1970
Junk, G.A.; Preston, F.J.; Svec, H.J.; Thompson, D.T., Ligand effects on the ionization potentials and bond energies of some L1L2Fe2(CO)6 complexes, J. Chem. Soc. A, 1970, 3171. [all data]