Dimethylvinylethynylhydroperoxide

Condensed phase thermochemistry data

Data compiled by: Hussein Y. Afeefy, Joel F. Liebman, and Stephen E. Stein

Quantity Value Units Method Reference Comment
Δfliquid63.6 ± 1.9kJ/molCcbVan-Chin-Syan, Dolbneva, et al., 1982
Quantity Value Units Method Reference Comment
Δcliquid-4247.4 ± 1.8kJ/molCcbVan-Chin-Syan, Dolbneva, et al., 1982Corresponding Δfliquid = 63.7 kJ/mol (simple calculation by NIST; no Washburn corrections)

References

Van-Chin-Syan, Dolbneva, et al., 1982
Van-Chin-Syan, Yu.Ya.; Dolbneva, T.N.; Vasil'ev, V.P.; Chuchmarev, S.K.; Puchin, V.A., Thermodynamic Properties of Dimethyl-vinylethynylmethanol and its derivatives, Russ. J. Phys. Chem. (Engl. Transl.), 1982, 56, 1736-1767. [all data]