Syn-(5,16:8,13)-diethenodibenzo[a,g]cyclododecene 6,7,14,15-tetrahydro-

Reaction thermochemistry data

Data compiled by: Hussein Y. Afeefy, Joel F. Liebman, and Stephen E. Stein

Individual Reactions

Syn-(5,16:8,13)-diethenodibenzo[a,g]cyclododecene 6,7,14,15-tetrahydro- = 5,16:8,13-Diethenodibenzo[a,g]cyclododecane, 6,7,14,15-tetrahydro

By formula: C24H20 = C24H20

Quantity Value Units Method Reference Comment
Δr-27.kJ/molCmMcBride, Keehn, et al., 1969solid phase; Differential scanning range -5.9 to-7.2 kcal/mol

Gas phase ion energetics data

Data compiled as indicated in comments:
LLK - Sharon G. Lias, Rhoda D. Levin, and Sherif A. Kafafi

Ionization energy determinations

IE (eV) Method Reference Comment
7.25PEKovac, Allan, et al., 1980Vertical value; LLK
7.50PEKovac, Allan, et al., 1980Vertical value; LLK

References

McBride, Keehn, et al., 1969
McBride, J.M.; Keehn, P.M.; Wasserman, H.H., Thermochemistry of syn- and anti-[2.2](1,4)naphthalenophane and dibenzoequinine, Tetrahedron Lett., 1969, 4147-4150. [all data]