1-Butylcyclopentanol

Phase change data

Data compiled as indicated in comments:
TRC - Thermodynamics Research Center, NIST Boulder Laboratories, Chris Muzny director
AC - William E. Acree, Jr., James S. Chickos

Quantity Value Units Method Reference Comment
Tboil465.4KN/AWalling and Padwa, 1963Uncertainty assigned by TRC = 1.5 K; TRC

Enthalpy of vaporization

ΔvapH (kJ/mol) Temperature (K) Method Reference Comment
63.5374.AStephenson and Malanowski, 1987Based on data from 359. - 466. K.; AC

In addition to the Thermodynamics Research Center (TRC) data available from this site, much more physical and chemical property data is available from the following TRC products:

References

Walling and Padwa, 1963
Walling, C.; Padwa, A., Positive Halogen Compounds VII. Intramolecular Chlorinations with Long Chain Hypochlorites, J. Am. Chem. Soc., 1963, 85, 1597. [all data]

Stephenson and Malanowski, 1987
Stephenson, Richard M.; Malanowski, Stanislaw, Handbook of the Thermodynamics of Organic Compounds, 1987, https://doi.org/10.1007/978-94-009-3173-2 . [all data]