4-Piperidinone, 1-methyl-

Phase change data

Data compiled as indicated in comments:
BS - Robert L. Brown and Stephen E. Stein
AC - William E. Acree, Jr., James S. Chickos

Quantity Value Units Method Reference Comment
Δvap54.2 ± 1.0kJ/molCRibeiro da Silva and Cabral, 2006AC

Reduced pressure boiling point

Tboil (K) Pressure (bar) Reference Comment
330.20.015Weast and Grasselli, 1989BS

References

Ribeiro da Silva and Cabral, 2006
Ribeiro da Silva, Manuel A.V.; Cabral, Joana I.T.A., Thermochemistry of Some Derivatives of 2- and 4-Piperidone, J. Chem. Eng. Data, 2006, 51, 5, 1556-1561, https://doi.org/10.1021/je060046t . [all data]

Weast and Grasselli, 1989
CRC Handbook of Data on Organic Compounds, 2nd Editon, Weast,R.C and Grasselli, J.G., ed(s)., CRC Press, Inc., Boca Raton, FL, 1989, 1. [all data]