p-toluidine, N-isoamyl-

Phase change data

Data compiled by: Thermodynamics Research Center, NIST Boulder Laboratories, Chris Muzny director

Quantity Value Units Method Reference Comment
Tboil539.65KN/AYoung and Wagner, 1937Uncertainty assigned by TRC = 2. K

In addition to the Thermodynamics Research Center (TRC) data available from this site, much more physical and chemical property data is available from the following TRC products:

References

Young and Wagner, 1937
Young, W.S.; Wagner, E.C., Condensation of Aromatic Amines with Formaldehyde in Media Containing Acid VII. The Polylmeric States and Atructures of Some Anhydro-p- (alkylamino)-benzyl Alcohols, J. Am. Chem. Soc., 1937, 59, 854. [all data]