Copper octaethylporphyrin

Normal alkane RI, non-polar column, temperature ramp

View large format table.

Column type Active phase I Reference Comment
CapillaryOV-15390.Marriott, Gill, et al., 1982H2, 7. K/min; Column length: 6. m; Column diameter: 0.30 mm; Tstart: 60. C; Tend: 300. C

Normal alkane RI, non-polar column, custom temperature program

View large format table.

Column type Active phase I Reference Comment
CapillaryCP Sil 5 CB5390.Marriott, Gill, et al., 1982, 2H2; Column length: 20. m; Column diameter: 0.34 mm; Program: not specified

Gas phase ion energetics data

Data compiled by: Sharon G. Lias, Rhoda D. Levin, and Sherif A. Kafafi

Ionization energy determinations

IE (eV) Method Reference Comment
6.31 ± 0.03PEKitagawa, Morishima, et al., 1979Vertical value

References

Marriott, Gill, et al., 1982
Marriott, P.J.; Gill, J.P.; Eglinton, G., Capillary Gas Chromatography of Metal-Porphyrin Complexes, J. Chromatogr., 1982, 236, 2, 395-401, https://doi.org/10.1016/S0021-9673(00)84890-6 . [all data]

Marriott, Gill, et al., 1982, 2
Marriott, P.J.; Gill, J.P.; Evershed, R.P.; Eglinton, G.; Maxwell, J.R., Capillary GC and GC-MS of porphyrins and metalloporphyrins, Chromatographia, 1982, 16, 1, 304-308, https://doi.org/10.1007/BF02258926 . [all data]