tris(3-methylpentane-2,4-dionato-O,O')chromium

Gas phase ion energetics data

Data compiled by: Henry M. Rosenstock, Keith Draxl, Bruce W. Steiner, and John T. Herron

Ionization energy determinations

IE (eV) Method Reference
7.81 ± 0.05EIBancroft, Reichert, et al., 1969

Appearance energy determinations

Ion AE (eV) Other Products MethodReferenceComment
C12H18O4Cr+10.7 ± 0.10?EIBancroft, Reichert, et al., 1969

References

Bancroft, Reichert, et al., 1969
Bancroft, G.M.; Reichert, C.; Westmore, J.B.; Gesser, H.D., Mass spectral studies of metal chelates. III. Mass spectra and appearance potentials of substituted acetylacetonates of trivalent chromium. Comparison with other trivalent metals of the first transition series, Inorg. Chem., 1969, 8, 474. [all data]