2-Pyridinamine, 1-oxide

Gas phase ion energetics data

Data compiled as indicated in comments:
LLK - Sharon G. Lias, Rhoda D. Levin, and Sherif A. Kafafi

Ionization energy determinations

IE (eV) Method Reference Comment
8.04 ± 0.05EIUndheim, El-Gendy, et al., 1974LLK

References

Undheim, El-Gendy, et al., 1974
Undheim, K.; El-Gendy, M.A.F.; Hurum, T., Mass spectrometry of onium compounds. XXVI. Ionisation potentials in structure analysis of gaseous aminopyridine 1-oxides, Acta Chem. Scand., Ser. B, 1974, 28, 743. [all data]