2-Pyridinecarboxylic acid, 4-amino-3,5,6-trichloro-, methyl ester

Phase change data

Data compiled by: William E. Acree, Jr., James S. Chickos

Enthalpy of fusion

ΔfusH (kJ/mol) Temperature (K) Method Reference
26.78394.3DSCPlato and Glasgow, 1969

Kovats' RI, non-polar column, isothermal

View large format table.

Column type Active phase Temperature (C) I Reference Comment
CapillaryOV-1160.1837.Erdmann, Rochholz, et al., 1992
CapillaryOV-1190.1872.Erdmann, Rochholz, et al., 1992

References

Plato and Glasgow, 1969
Plato, Candace.; Glasgow, Augustus R., Differential scanning calorimetry as a general method for determining the purity and heat of fusion of high-purity organic chemicals. Application to 95 compounds, Anal. Chem., 1969, 41, 2, 330-336, https://doi.org/10.1021/ac60271a041 . [all data]