Molybdenum iodide

Condensed phase thermochemistry data

Quantity Value Units Method Reference Comment
Δfsolid-124.68kJ/molReviewChase, 1998Data last reviewed in September, 1978
Quantity Value Units Method Reference Comment
solid195.39J/mol*KReviewChase, 1998Data last reviewed in September, 1978

Solid Phase Heat Capacity (Shomate Equation)

Cp° = A + B*t + C*t2 + D*t3 + E/t2
H° − H°298.15= A*t + B*t2/2 + C*t3/3 + D*t4/4 − E/t + F − H
S° = A*ln(t) + B*t + C*t2/2 + D*t3/3 − E/(2*t2) + G
    Cp = heat capacity (J/mol*K)
    H° = standard enthalpy (kJ/mol)
    S° = standard entropy (J/mol*K)
    t = temperature (K) / 1000.

View plot Requires a JavaScript / HTML 5 canvas capable browser.

View table.

Temperature (K) 298. - 1000.
A 103.9506
B 16.57195
C 0.053553
D -0.017104
E -0.000695
F -156.4151
G 316.2426
H -124.6832
ReferenceChase, 1998
Comment Data last reviewed in September, 1978

References

Chase, 1998
Chase, M.W., Jr., NIST-JANAF Themochemical Tables, Fourth Edition, J. Phys. Chem. Ref. Data, Monograph 9, 1998, 1-1951. [all data]