Cyclopentane-1,2-dione, 3,3,5,5-tetramethyl, bis(o-methyloxime)-(E,Z)-

Gas phase ion energetics data

Data compiled by: Sharon G. Lias, John E. Bartmess, Joel F. Liebman, John L. Holmes, Rhoda D. Levin, and W. Gary Mallard

Ionization energy determinations

IE (eV) Method Reference Comment
7.9PEStunnenberg and Cerfontain, 1987
8.58PEStunnenberg and Cerfontain, 1987Vertical value

References

Stunnenberg and Cerfontain, 1987
Stunnenberg, F.; Cerfontain, H., He I and He II photoelectron spectra and SCF-LCAO-MO calculations on the three geometric isomers of 3,3,5,5-tetramethyl-1,2-bis(methoxyimino)cyclopentane, J. Phys. Chem., 1987, 91, 6490. [all data]