Pyrazine, 2-ethyl-3,5-dimethyl-

Kovats' RI, non-polar column, temperature ramp

View large format table.

Column type Active phase I Reference Comment
CapillarySE-301059.Greenberg, 1981He, 40. C @ 3. min, 3. K/min; Column length: 50. m; Column diameter: 0.5 mm; Tend: 170. C
CapillarySE-301062.Greenberg, 1981He, 40. C @ 3. min, 3. K/min; Column length: 50. m; Column diameter: 0.5 mm; Tend: 170. C

Van Den Dool and Kratz RI, non-polar column, temperature ramp

View large format table.

Column type Active phase I Reference Comment
CapillaryDB-51079.Steinhaus and Schieberle, 200730. m/0.32 mm/0.25 μm, 40. C @ 2. min, 6. K/min, 240. C @ 10. min
CapillaryCP Sil 8 CB1075.Mahadevan and Farmer, 200660. C @ 5. min, 4. K/min, 220. C @ 30. min; Column length: 50. m; Column diameter: 0.32 mm
CapillaryBPX-51093.Bredie, Mottram, et al., 200250. m/0.32 mm/0.5 μm, 60. C @ 5. min, 4. K/min, 250. C @ 20. min
CapillaryBPX-51088.Ames, Guy, et al., 200150. m/0.32 mm/0.25 μm, He, 60. C @ 5. min, 4. K/min, 250. C @ 10. min
CapillaryBPX-51092.Ames, Guy, et al., 200150. m/0.32 mm/0.25 μm, He, 60. C @ 5. min, 4. K/min, 250. C @ 10. min
CapillaryDB-5MS1074.Baek, Kim, et al., 200160. m/0.25 mm/0.25 μm, He, 40. C @ 5. min, 3. K/min, 200. C @ 60. min
CapillaryBPX-51084.Oruna-Concha, Duckham, et al., 200150. m/0.32 mm/0.25 μm, He, 35. C @ 3. min, 4. K/min, 250. C @ 10. min
CapillaryBPX-51082.Oruna-Concha, Duckham, et al., 200150. m/0.32 mm/0.25 μm, He, 35. C @ 3. min, 4. K/min, 250. C @ 10. min
CapillaryDB-11070.Wu, Wang, et al., 200060. m/0.25 mm/1. μm, N2, 5. K/min, 200. C @ 30. min; Tstart: 30. C
CapillaryDB-11068.Wu, Wang, et al., 200060. m/0.25 mm/1. μm, N2, 5. K/min, 200. C @ 30. min; Tstart: 30. C
CapillaryBPX-51086.Hill, Isaacs, et al., 199950. m/0.325 mm/0.5 μm, He, 20. C @ 2. min, 4. K/min, 250. C @ 10. min
CapillaryBPX-51087.Hill, Isaacs, et al., 199950. m/0.325 mm/0.5 μm, He, 20. C @ 2. min, 4. K/min, 250. C @ 10. min
CapillaryBPX-51085.Ames, Defaye, et al., 199750. m/0.325 mm/0.5 μm, He, 50. C @ 2. min, 4. K/min, 250. C @ 10. min
CapillaryDB-11064.Specht and Baltes, 199460. m/0.25 mm/0.25 μm, 35. C @ 10. min, 2. K/min, 280. C @ 10. min
CapillaryHP-11064.Zhang, Dorjpalam, et al., 199250. m/0.32 mm/1.5 μm, 2. K/min, 220. C @ 30. min; Tstart: 40. C
CapillarySE-301060.Misharina, Golovnya, et al., 199150. m/0.32 mm/0.25 μm, 4. K/min; Tstart: 50. C; Tend: 240. C
CapillaryDB-11067.Zhang and Ho, 199160. m/0.25 mm/0.25 μm, He, 2. K/min, 220. C @ 10. min; Tstart: 40. C

Van Den Dool and Kratz RI, non-polar column, custom temperature program

View large format table.

Column type Active phase I Reference Comment
CapillarySPB-51081.Majcher and Jelen, 200730. m/0.53 mm/1.5 μm; Program: 40C(1min) => 6C/min => 180C => 20C/min => 280C
CapillarySE-541084.Frauendorfer and Schieberle, 200625. m/0.32 mm/0.25 μm, He; Program: 40C(1min) => 40C/min => 60C(1min) => 4C/min => 140C => 20C/min => 240C(5min)
CapillaryZB-51059.Lu, Hao, et al., 200530. m/0.25 mm/0.25 μm, He; Program: 50C(1min) => 3C/min => 209C => 20C/min => 280C
CapillaryDB-51081.Majcher and Jelén, 200530. m/0.25 mm/0.25 μm, He; Program: 40C(1min) => 6C/min => 180C => 20C/min => 280C
CapillaryCP Sil 8 CB1088.Duckham, Dodson, et al., 200160. m/0.25 mm/0.25 μm; Program: 0C => rapidly => 40C(8min) => 4C/min => 250C(10min)
CapillaryDB-51082.Rychlik and Bosset, 200130. m/0.32 mm/0.25 μm, He; Program: 35C(2min) => 40C/min => 60C (2min) => 4C/min => 240C
CapillaryDB-51098.Parker, Hassell, et al., 200050. m/0.32 mm/0.5 μm, He; Program: oC(5min) => 60C/min => 60C (5min) => 4C/min => 250C
CapillarySE-541083.Tairu, Hofmann, et al., 200030. m/0.32 mm/0.25 μm, He; Program: 35C (2min) => 40C/min => 60C (2min) => 6C/min => 180C (5min) => 10C/min => 230C (5min)
CapillaryBPX-51087.Bredie, Mottram, et al., 199850. m/0.32 mm/0.5 μm, He; Program: OC (5min) => 60C/min => 60C(5min) => 4C/min => 250C
CapillarySE-541085.Fickert and Schieberle, 199825. m/0.32 mm/0.5 μm, He; Program: 35C (2min) => 4C/min => 150C => 10C/min => 240C
CapillarySE-541083.Hofmann and Schieberle, 199830. m/0.32 mm/0.25 μm; Program: 35C(2min) => 40C/min => 50C(5min) => 6C/min => 230C(15min)
CapillarySE-541079.Münch, Hofmann, et al., 199730. m/0.32 mm/0.25 μm, He; Program: 40C (2min) => 40C/min => 50C (2min) => 240C (10min)
CapillaryBPX-51088.Owens J.D., Allagheny N., et al., 199750. m/0.32 mm/0.5 μm, He; Program: OC => 60C/min => 60C(5min) => 4C/min => 250C(20min)
CapillaryDB-11068.Kuo, Zhang, et al., 198960. m/0.32 mm/0.25 μm, He; Program: -40C => 40C/min => 40C => 2C/min => 260C

Van Den Dool and Kratz RI, polar column, temperature ramp

View large format table.

Column type Active phase I Reference Comment
CapillaryDB-Wax1464.Pozo-Bayon M.A., Ruiz-Rodriguez A., et al., 200730. m/0.25 mm/0.5 μm, He, 40. C @ 5. min, 4. K/min, 250. C @ 15. min
CapillaryDB-Wax1464.Pozo-Bayon M.A., Ruiz-Rodriguez A., et al., 200730. m/0.25 mm/0.5 μm, He, 40. C @ 5. min, 4. K/min, 250. C @ 15. min
CapillaryFFAP1435.Steinhaus and Schieberle, 200730. m/0.32 mm/0.25 μm, 40. C @ 2. min, 6. K/min, 240. C @ 10. min
CapillaryDB-Wax1455.Lopez-Galilea I., Fournier N., et al., 200630. m/0.32 mm/0.5 μm, He, 5. K/min, 240. C @ 10. min; Tstart: 40. C
CapillaryDB-Wax1455.Lopez-Galilea I., Fournier N., et al., 200630. m/0.32 mm/0.5 μm, He, 5. K/min, 240. C @ 10. min; Tstart: 40. C
CapillaryCP-Wax 52CB1449.Mahadevan and Farmer, 200660. C @ 5. min, 4. K/min, 220. C @ 30. min; Column length: 50. m; Column diameter: 0.32 mm
CapillaryCP-Wax 52CB1456.Mahadevan and Farmer, 200660. C @ 5. min, 4. K/min, 220. C @ 30. min; Column length: 50. m; Column diameter: 0.32 mm
CapillaryFFAP1494.Stephan and Steinhart, 199960. m/0.25 mm/0.5 μm, 50. C @ 3. min, 5. K/min, 230. C @ 15. min
CapillaryPEG-20M1462.Shimoda, Nakada, et al., 199760. m/0.25 mm/0.25 μm, He, 2. K/min, 230. C @ 60. min; Tstart: 50. C
CapillaryDB-Wax1462.Shimoda, Shiratsuchi, et al., 199660. m/0.25 mm/0.25 μm, He, 2. K/min, 230. C @ 60. min; Tstart: 50. C
CapillarySupelcowax-101434.Cadwallader, Tan, et al., 199560. m/0.25 mm/0.25 μm, He, 40. C @ 5. min, 2. K/min, 200. C @ 30. min
CapillarySupelcowax-101446.Tanchotikul and Hsieh, 198960. m/0.25 mm/0.25 μm, 40. C @ 5. min, 2. K/min, 175. C @ 20. min
CapillarySupelcowax-101447.Tanchotikul and Hsieh, 198960. m/0.25 mm/0.25 μm, 40. C @ 5. min, 2. K/min, 175. C @ 20. min
CapillaryCP-WAX 57CB1466.Salter L.J., Mottram D.S., et al., 198860. C @ 5. min, 4. K/min; Column length: 50. m; Column diameter: 0.32 mm; Tend: 200. C
CapillaryCP-WAX 57CB1466.Whitfield, Mottram, et al., 1988He, 60. C @ 5. min, 4. K/min, 200. C @ 10. min; Column length: 50. m; Column diameter: 0.32 mm
CapillaryCP-WAX 57CB1466.Whitfield, Mottram, et al., 1988He, 60. C @ 5. min, 4. K/min, 200. C @ 10. min; Column length: 50. m; Column diameter: 0.32 mm

Van Den Dool and Kratz RI, polar column, custom temperature program

View large format table.

Column type Active phase I Reference Comment
CapillarySupelcowax-101443.Bianchi, Careri, et al., 200730. m/0.25 mm/0.25 μm, He; Program: 35C(8min) => 4C/min => 60C => 6C/min => 160C => 20C/min => 200C(1min)
CapillarySupelcowax-101444.Bianchi, Careri, et al., 200730. m/0.25 mm/0.25 μm, He; Program: 35C(8min) => 4C/min => 60C => 6C/min => 160C => 20C/min => 200C(1min)
CapillarySupelcowax-101437.Majcher and Jelen, 200730. m/0.25 mm/0.25 μm; Program: 40C(2min) => 40C/min => 60C(2min) => 5C/min => 240C
CapillaryFFAP1446.Frauendorfer and Schieberle, 200625. m/0.32 mm/0.2 μm, He; Program: 40C(1min) => 40C/min => 60C(1min) => 6C/min => 180C => 15C/min => 240C
CapillarySupelcowax-101437.Majcher and Jelén, 200530. m/0.25 mm/0.25 μm, He; Program: 40C(2min) => 40C/min => 60(2min)C => 5C/min => 240C
CapillaryCP-Wax 52CB1454.Alasalvar, Shahidi, et al., 200360. m/0.25 mm/0.25 μm, He; Program: 40C => 5C/min => 60C => 2.5C/min => 155C
CapillaryFFAP1453.Rhlid, Fleury, et al., 200230. m/0.32 mm/0.25 μm; Program: 50C (2min) => 6C/min => 180C => 10C/min => 240C(10min)
CapillaryFFAP1451.Rhlid, Fleury, et al., 200230. m/0.32 mm/0.25 μm; Program: 50C (2min) => 6C/min => 180C => 10C/min => 240C(10min)
CapillaryFFAP1455.Tairu, Hofmann, et al., 200030. m/0.32 mm/0.25 μm, He; Program: 35C (2min) => 40C/min => 60C (2min) => 6C/min => 180C (5min) => 10C/min => 230C (5min)
CapillaryFFAP1454.Fickert and Schieberle, 199825. m/0.32 mm/0.5 μm, He; Program: 35C (2min) => 40C/min => 60C => 6C/min => 230C (10min)
CapillaryFFAP1461.Hofmann and Schieberle, 199830. m/0.32 mm/0.25 μm; Program: 35C(2min) => 40C/min => 60C(5min) => 6C/min => 230C(15min)
CapillaryFFAP1440.Münch, Hofmann, et al., 199730. m/0.32 mm/0.25 μm, He; Program: 40C (2min) => 40C/min => 60C (2min) => 240C (10min)
CapillarySupelcowax-101455.Baek and Cadwallader, 199660. m/0.25 mm/0.25 μm; Program: 40C => (6C/min) => 80C(6min) => (15C/min) => 200C(10min)
CapillaryDB-Wax1455.Amrani-Hemaimi, Cerny, et al., 199530. m/0.32 mm/0.25 μm, He; Program: 35C(2min) => 6C/min => 150C => 30C/min => 240C(1min)

Normal alkane RI, non-polar column, temperature ramp

View large format table.

Column type Active phase I Reference Comment
CapillaryDB-5 MS1091.Chen, Song, et al., 200930. m/0.32 mm/0.25 μm, Helium, 40. C @ 2. min, 6. K/min, 230. C @ 20. min
CapillaryDB-5 MS1092.Chen, Song, et al., 200930. m/0.32 mm/0.25 μm, Helium, 40. C @ 2. min, 6. K/min, 250. C @ 20. min
CapillarySLB-5MS1094.Risticevic, Carasek, et al., 200810. m/0.18 mm/0.18 μm, Helium, 40. C @ 1.5 min, 10. K/min; Tend: 295. C
CapillaryDB-51090.Fadel, Mageed, et al., 2006He, 60. C @ 5. min, 4. K/min; Column length: 60. m; Column diameter: 0.32 mm; Tend: 250. C
CapillaryDB-5 MS1095.Schirack, Drake, et al., 200630. m/0.25 mm/0.25 μm, 40. C @ 3. min, 8. K/min, 200. C @ 20. min
CapillaryHP-51078.6Leffingwell and Alford, 200560. m/0.32 mm/0.25 μm, He, 30. C @ 2. min, 2. K/min, 260. C @ 28. min
CapillaryMDN-51085.van Loon, Linssen, et al., 200560. m/0.25 mm/0.25 μm, He, 40. C @ 4. min, 4. K/min, 270. C @ 5. min
CapillaryMDN-51090.van Loon, Linssen, et al., 200560. m/0.25 mm/0.25 μm, He, 40. C @ 4. min, 4. K/min, 270. C @ 5. min
CapillaryDB-51080.Sanz, Czerny, et al., 200230. m/0.32 mm/0.25 μm, He, 40. C @ 2. min, 6. K/min, 230. C @ 5. min
CapillaryDB-5MS1084.Cadwallader and Heo, 200130. m/0.53 mm/1.5 μm, He, 40. C @ 5. min, 6. K/min, 225. C @ 30. min
CapillaryDB-5MS1095.Welty, Marshall, et al., 2001He, 40. C @ 5. min, 5. K/min, 220. C @ 5. min; Column length: 50. m; Column diameter: 0.25 mm
CapillaryHP-51085.Boylston and Viniyard, 199850. m/0.32 mm/0.52 μm, 35. C @ 15. min, 2. K/min, 250. C @ 45. min
CapillaryOV-1011045.Deibler, Acree, et al., 199810. m/0.25 mm/0.52 μm, Helium, 35. C @ 3. min, 6. K/min; Tend: 225. C
CapillaryDB-11054.Buttery, Ling, et al., 199730. C @ 25. min, 4. K/min, 200. C @ 20. min; Column length: 60. m; Column diameter: 0.25 mm
CapillaryUltra 11058.Farkas, Sádecká, et al., 199750. m/0.20 mm/0.33 μm, Helium, 30. C @ 1. min, 1.7 K/min; Tend: 250. C
CapillaryDB-11072.Lu, Yu, et al., 199760. m/0.32 mm/1. μm, He, 40. C @ 2. min, 2. K/min, 280. C @ 40. min
CapillaryDB-11065.Yu and Ho, 199560. m/0.25 mm/1. μm, He, 40. C @ 5. min, 2. K/min, 260. C @ 60. min
CapillaryDB-11072.Yu, Wu, et al., 199460. m/0.25 mm/1.0 μm, He, 40. C @ 5. min, 2. K/min, 260. C @ 60. min
CapillaryOV-1011064.Mihara and Masuda, 1987N2, 2. K/min; Column length: 50. m; Column diameter: 0.22 mm; Tstart: 80. C; Tend: 200. C
CapillaryOV-11056.Wu, Liou, et al., 1987Hydrogen, 1. K/min, 200. C @ 35. min; Column length: 50. m; Column diameter: 0.20 mm; Tstart: 50. C
CapillaryMethyl Silicone1056.Lorenz, Stern, et al., 19834. K/min, 200. C @ 15. min; Column length: 25. m; Column diameter: 0.2 mm; Tstart: 50. C
CapillaryMethyl Silicone1059.Lorenz, Stern, et al., 19834. K/min, 200. C @ 15. min; Column length: 25. m; Column diameter: 0.2 mm; Tstart: 50. C
CapillarySE-301062.Heydanek and McGorrin, 1981He, 40. C @ 3. min, 3. K/min; Column length: 50. m; Column diameter: 0.5 mm; Tend: 170. C

Normal alkane RI, non-polar column, custom temperature program

View large format table.

Column type Active phase I Reference Comment
CapillaryDB-51077.Yu and Zhang, 201030. m/0.25 mm/0.25 μm; Program: 40 0C (5 min) 5 0C/min -> 260 0C 15 0C/min -> 280 0C (1 min)
CapillarySE-541084.Frauendorfer and Schieberle, 2008Helium; Program: not specified
CapillarySLB-5MS1083.Risticevic, Carasek, et al., 200810. m/0.18 mm/0.18 μm, Helium; Program: not specified
CapillaryHP-5 MS1088.Wan Aida, Ho, et al., 200830. m/0.25 mm/0.25 μm, Helium; Program: 50 0C (2 min) 20 0C/min -> 80 0C (1 min) 20 0C -> 100 0C (1 min) 30 0C/min -> 230 0C (2 min)
CapillaryHP-51077.Characterization of Pyrazines in Some Chinese Liquors and Their Approximate Concentrations, 200730. m/0.25 mm/0.25 μm, He; Program: 50C(2min) => 2C/min => 140C => 10C/min => 280C (10min)
CapillaryHP-5MS1088.Ho, Wan Aida, et al., 200730. m/0.25 mm/0.25 μm, He; Program: 50C(2min) => 20C/min => 80C (1min) => 20C/min => 100C(1min) => 30C/min => 230C(3min)
CapillarySE-541083.Lasekan, Buettner, et al., 200730. m/0.32 mm/0.25 μm; Program: 35C(2min) => 40C/min => 60C(2min) => 6C/min => 180C => 10C/min => 230C(10min)
CapillaryCP Sil 5 CB1058.Bailly, Jerkovic, et al., 200650. m/0.32 mm/1.2 μm, He; Program: 36C => 20C/min => 85C => 1C/min => 145C => 3C/min => 250C
CapillaryHP-11047.Carpino, Mallia, et al., 200412. m/0.32 mm/0.52 μm; Program: 35C(3min) => 6C/min => 190C => 30C/min => 225C
CapillaryCP Sil 5 CB1056.Counet, Ouwerx, et al., 200450. m/0.32 mm/1.2 μm; Program: 36C => 20C/min => 85C => 1C/min => 145C => 3C/min => 250C(30min)
CapillaryDB-51062.Bücking and Steinhart, 200230. m/0.53 mm/1.5 μm; Program: -5C(1min) => 4C/min => 50C => 6C/min => 120C => 8C/min => 250C(2min)
CapillaryCP Sil 5 CB1057.Counet, Callemien, et al., 200250. m/0.32 mm/1.2 μm; Program: 36C => 20C/min => 85C => 1C/min => 145C=3C/min => 250C(30min)
CapillaryCP Sil 8 CB1087.Duckham, Dodson, et al., 200160. m/0.25 mm/0.25 μm; Program: not specified
CapillaryCP Sil 8 CB1093.Duckham, Dodson, et al., 200160. m/0.25 mm/0.25 μm; Program: not specified
CapillaryRTX-51089.Masanetz, Guth, et al., 1998Program: not specified
CapillaryDB-51082.Matsui, Guth, et al., 199830. m/0.32 mm/0.25 μm, He; Program: 35C(1min) => 40C/min => 60C (1min) => 6C/min => 230C
CapillarySE-541086.Zehentbauer and Grosch, 199825. m/0.32 mm/0.25 μm, He; Program: 35C(2min) => 50C/min => 60C(2min) => 4C/min => 230C
CapillarySE-541083.Schermann and Schieberle, 199730. m/0.32 mm/0.25 μm, He; Program: 35C (2min) => 40C/min => 60C (2min) => 6C/min => 180C => 10C/min => 240C
CapillarySE-541083.Schermann and Schieberle, 199730. m/0.32 mm/0.25 μm, He; Program: 35C (2min) => 40C/min => 60C (2min) => 6C/min => 180C => 10C/min => 240C
CapillarySE-541083.Schermann and Schieberle, 199730. m/0.32 mm/0.25 μm, He; Program: 35C (2min) => 40C/min => 60C (2min) => 6C/min => 180C => 10C/min => 240C
CapillaryDB-51083.Schieberle, 1996Column length: 30. m; Column diameter: 0.32 mm; Program: not specified
CapillaryDB-51083.Schieberle and Grosch, 1994He; Column length: 30. m; Column diameter: 0.32 mm; Program: 35C => 40C/min => 50C(2min) => 4C/min => 240C
CapillarySE-541082.Guth and Grosch, 1993Program: not specified
CapillarySE-541083.Blank, Sen, et al., 1992Program: not specified
CapillaryDB-11060.Kawai, Ishida, et al., 199160. m/0.25 mm/0.25 μm; Program: not specified
CapillaryDB-11061.Kawai, Ishida, et al., 199160. m/0.25 mm/0.25 μm; Program: not specified

Normal alkane RI, polar column, temperature ramp

View large format table.

Column type Active phase I Reference Comment
CapillaryHP-Innowax1440.Puvipirom and Chaisei, 201215. m/0.32 mm/0.50 μm, Helium, 3. K/min; Tstart: 40. C; Tend: 250. C
CapillaryDB-Wax1470.Onishi, Inoue, et al., 201160. m/0.25 mm/0.25 μm, Helium, 50. C @ 2. min, 3. K/min, 220. C @ 20. min
CapillaryDB-Wax1464.Kumazawa, Sakai, et al., 201030. m/0.25 mm/0.25 μm, Helium, 3. K/min; Tstart: 40. C; Tend: 210. C
CapillaryDB-Wax1477.Rochat, Egger, et al., 200930. m/0.25 mm/0.25 μm, Helium, 60. C @ 3. min, 8. K/min, 200. C @ 9.5 min
CapillaryDB-Wax1447.Characterization of Pyrazines in Some Chinese Liquors and Their Approximate Concentrations, 200730. m/0.25 mm/0.25 μm, He, 4. K/min, 230. C @ 15. min; Tstart: 50. C
CapillaryDB-Wax1443.Schirack, Drake, et al., 200630. m/0.25 mm/0.25 μm, 40. C @ 3. min, 8. K/min, 200. C @ 20. min
CapillaryTC-Wax1474.Ishizaki, Tachihara, et al., 200560. m/0.25 mm/0.25 μm, N2, 3. K/min, 220. C @ 40. min; Tstart: 70. C
CapillaryDB-Wax1470.Kumazawa, Kubota, et al., 200530. m/0.25 mm/0.25 μm, He, 5. K/min; Tstart: 40. C; Tend: 210. C
CapillaryTC-Wax1475.Ishikawa, Ito, et al., 200460. m/0.25 mm/0.5 μm, He, 40. C @ 8. min, 3. K/min; Tend: 230. C
CapillaryDB-Wax1445.Akiyama, Murakami, et al., 200360. m/0.32 mm/0.25 μm, He, 6. K/min, 230. C @ 20. min; Tstart: 40. C
CapillaryHP-Wax1475.Andueza, Maeztu, et al., 200360. m/0.25 mm/0.5 μm, He, 40. C @ 6. min, 3. K/min; Tend: 199. C
CapillaryHP-Wax1475.Andueza, de Peña, et al., 200360. m/0.25 mm/0.5 μm, He, 40. C @ 6. min, 3. K/min; Tend: 190. C
CapillaryDB-Wax1470.Kumazawa and Masuda, 200230. m/0.25 mm/0.25 μm, He, 5. K/min; Tstart: 40. C; Tend: 210. C
CapillaryDB-Wax1470.Kumazawa and Masuda, 200260. m/0.25 mm/0.25 μm, He, 5. K/min; Tstart: 40. C; Tend: 210. C
CapillaryDB-FFAP1444.Sanz, Czerny, et al., 200230. m/0.32 mm/0.25 μm, He, 40. C @ 2. min, 6. K/min, 230. C @ 5. min
CapillaryDB-Wax1467.Cadwallader and Heo, 200130. m/0.53 mm/1. μm, He, 40. C @ 5. min, 6. K/min, 225. C @ 30. min
CapillaryHP-Wax1475.Maeztu, Sanz, et al., 200160. m/0.25 mm/0.5 μm, He, 40. C @ 6. min, 3. K/min; Tend: 190. C
CapillaryDB-Wax1469.Kim, Baek, et al., 200030. m/0.32 mm/0.25 μm, 40. C @ 5. min, 8. K/min, 280. C @ 30. min
CapillaryDB-Wax1455.Buttery, Orts, et al., 199930. C @ 4. min, 2. K/min, 170. C @ 60. min; Column length: 60. m; Column diameter: 0.32 mm
CapillaryDB-Wax1476.Kumazawa and Masuda, 199930. m/0.53 mm/1. μm, 5. K/min; Tstart: 40. C; Tend: 210. C
CapillaryDB-Wax1475.Kumazawa and Masuda, 199960. m/0.25 mm/0.25 μm, 5. K/min; Tstart: 40. C; Tend: 210. C
CapillaryDB-Wax1455.Buttery and Ling, 199830. C @ 4. min, 2. K/min, 170. C @ 30. min; Column length: 60. m; Column diameter: 0.25 mm
CapillaryCP-Wax 52CB1465.Chyau, Lin, et al., 199750. m/0.32 mm/0.25 μm, He, 50. C @ 5. min, 1.5 K/min, 210. C @ 10. min
CapillaryDB-Wax1460.Umano, Hagi, et al., 1995He, 40. C @ 2. min, 2. K/min; Column length: 60. m; Column diameter: 0.25 mm; Tend: 200. C
CapillaryFFAP1450.Vernin, Metzger, et al., 1988He, 60. C @ 5. min, 2. K/min; Column length: 50. m; Column diameter: 0.28 mm; Tend: 240. C
CapillaryFFAP1450.Vernin, Metzger, et al., 1988He, 60. C @ 5. min, 2. K/min; Column length: 50. m; Column diameter: 0.28 mm; Tend: 240. C
CapillaryDB-Wax1455.Wong and Bernhard, 1988He, 70. C @ 8. min, 2. K/min; Column length: 30. m; Column diameter: 0.25 mm; Tend: 160. C
CapillaryCarbowax 20M1446.Wu, Liou, et al., 1987Hydrogen, 1. K/min, 200. C @ 35. min; Column length: 50. m; Column diameter: 0.20 mm; Tstart: 50. C
PackedCarbowax1434.Schieberle and Grosch, 1983He, Chromosorb G AW DMCS, 4. K/min; Column length: 3. m; Tstart: 60. C; Tend: 180. C
CapillaryCarbowax 20M1447.Liardon and Ledermann, 1980H2, 2. K/min; Column length: 39. m; Column diameter: 0.30 mm; Tstart: 60. C; Tend: 220. C
CapillaryCarbowax 20M1460.Shibamoto and Russell, 19771. K/min; Column length: 100. m; Column diameter: 0.25 mm; Tstart: 70. C; Tend: 170. C
CapillaryCarbowax 20M1460.Shibamoto and Russell, 19771. K/min; Column length: 100. m; Column diameter: 0.25 mm; Tstart: 70. C; Tend: 170. C

Normal alkane RI, polar column, custom temperature program

View large format table.

Column type Active phase I Reference Comment
CapillaryEC-10001440.Delabre and Bendall, 9999Program: not specified
CapillaryDB-Wax1458.Rochat, Egger, et al., 200930. m/0.25 mm/0.25 μm, Helium; Program: not specified
CapillaryFFAP1430.Frauendorfer and Schieberle, 2008Helium; Program: not specified
CapillaryDB-FFAP1451.Lasekan, Buettner, et al., 200730. m/0.32 mm/0.25 μm; Program: 35C(2min) => 40C/min => 50C(2min) => 6C/min => 180C => 10C/min => 230C(10min)
CapillaryFFAP1463.Bailly, Jerkovic, et al., 200625. m/0.32 mm/0.3 μm, He; Program: 36C => 20C/min => 85C => 1C/min => 145C => 3C/min => 250C
CapillaryTC-Wax1474.Kraft and Switt, 2005Program: not specified
CapillaryFFAP1459.Didzbalis, Ritter, et al., 200430. m/0.32 mm/0.25 μm, He; Program: 35C(1min) => 60C/min => 60C => 6C/min => 230C
CapillaryInnowax1472.Ito and Mori, 200430. m/0.25 mm/0.50 μm, Helium; Program: 40 0C (2 min) 10 0C/min -> 100 0C 3 0C/min -> 160 0C 5 0C/min -> 260 0C (10 min)
CapillaryTC-Wax1474.Tachihara, Ishizaki, et al., 2004Program: not specified
CapillarySupelcowax-101455.Baek and Cadwallader, 200360. m/0.25 mm/0.25 μm; Program: not specified
CapillaryFFAP1451.Bel Rhild, Fleury, et al., 200230. m/0.32 mm/0.25 μm, Helium; Program: 50 0C (2 min) 6 0C/min -> 180 0C 10 0C/min -> 180 0C (10 min)
CapillaryFFAP1453.Bel Rhild, Fleury, et al., 200230. m/0.32 mm/0.25 μm, Helium; Program: 50 0C (2 min) 6 0C/min -> 180 0C 10 0C/min -> 180 0C (10 min)
CapillaryFFAP1451.Bel Rhild, Fleury, et al., 2002, 230. m/0.32 mm/0.25 μm, Helium; Program: 50 0C (2 min) 6 oC/min -> 180 0C 10 0C/min -> 240 0C (10 min)
CapillaryDB-FFAP1450.Mayer and Grosch, 200130. m/0.32 mm/0.25 μm, He; Program: 35 0C (2 min) 40 K/min -> 60 0C (1 min) 6 K/min -> 240 0C
CapillaryFFAP1432.Matsui, Guth, et al., 199830. m/0.32 mm/0.25 μm, He; Program: 35C(1min) => 40C/min => 60C (1min) => 6C/min => 230C
CapillaryFFAP1439.Zehentbauer and Grosch, 199825. m/0.32 mm/0.25 μm, He; Program: 35C(2min) => 40C/min => 60C(2min) => 6C/min => 230C
CapillaryFFAP1461.Schermann and Schieberle, 199730. m/0.32 mm/0.25 μm, He; Program: 35C (2min) => 40C/min => 60C (2min) => 6C/min => 180C => 10C/min => 240C
CapillaryFFAP1461.Schermann and Schieberle, 199730. m/0.32 mm/0.25 μm, He; Program: 35C (2min) => 40C/min => 60C (2min) => 6C/min => 180C => 10C/min => 240C
CapillarySupelcowax-101447.Schieberle and Grosch, 1994He; Column length: 30. m; Column diameter: 0.32 mm; Program: 35C => 40C/min => 60C(2min) => 4C/min => 240C
CapillaryFFAP1443.Guth and Grosch, 1993Program: not specified
CapillaryFFAP1453.Blank, Sen, et al., 1992Program: not specified
CapillaryCarbowax 20M1415.Mihara and Masuda, 1987Program: not specified

References

Greenberg, 1981
Greenberg, M.J., Characterization of meat and bone meal flavor volatiles, J. Agric. Food Chem., 1981, 29, 6, 1276-1280, https://doi.org/10.1021/jf00108a043 . [all data]

Steinhaus and Schieberle, 2007
Steinhaus, P.; Schieberle, P., Characterization of the key aroma compounds in soy sauce using approaches of molecular sensory science, J. Agric. Food Chem., 2007, 55, 15, 6262-6269, https://doi.org/10.1021/jf0709092 . [all data]

Mahadevan and Farmer, 2006
Mahadevan, K.; Farmer, L., Key Odor Impact Compounds in Three Yeast Extract Pastes, J. Agric. Food Chem., 2006, 54, 19, 7242-7250, https://doi.org/10.1021/jf061102x . [all data]

Bredie, Mottram, et al., 2002
Bredie, W.L.P.; Mottram, D.S.; Guy, R.C.E., Effect of temperature and pH on the generation of flavor volatiles in extrusion cooking of wheat flour, J. Agric. Food Chem., 2002, 50, 5, 1118-1125, https://doi.org/10.1021/jf0111662 . [all data]

Ames, Guy, et al., 2001
Ames, J.M.; Guy, R.C.E.; Kipping, G.J., Effect of pH, temperature, and moisture on the formation of volatile compounds in glycine/glucose model systems, J. Agric. Food Chem., 2001, 49, 9, 4315-4323, https://doi.org/10.1021/jf010198m . [all data]

Baek, Kim, et al., 2001
Baek, H.H.; Kim, C.J.; Ahn, B.H.; Nam, H.S.; Cadwallader, K.R., Aroma extract dilution analysis of a beeflike process flavor from extruded enzyme-hydrolyzed soybean protein, J. Agric. Food Chem., 2001, 49, 2, 790-793, https://doi.org/10.1021/jf000609j . [all data]

Oruna-Concha, Duckham, et al., 2001
Oruna-Concha, M.J.; Duckham, S.C.; Ames, J.M., Comparison of volatile compounds isolated from the skin and flesh of four potato cultivars after baking, J. Agric. Food Chem., 2001, 49, 5, 2414-2421, https://doi.org/10.1021/jf0012345 . [all data]

Wu, Wang, et al., 2000
Wu, C.-M.; Wang, Z.; Wu, Q.H., Volatile compounds produced from monosodium glutamate in common food cooking, J. Agric. Food Chem., 2000, 48, 6, 2438-2442, https://doi.org/10.1021/jf9907743 . [all data]

Hill, Isaacs, et al., 1999
Hill, V.M.; Isaacs, N.S.; Ledward, D.A.; Ames, J.M., Effect of high hydrostatic pressure on the volatile components of a glucose-lysine model system, J. Agric. Food Chem., 1999, 47, 9, 3675-3681, https://doi.org/10.1021/jf990124z . [all data]

Ames, Defaye, et al., 1997
Ames, J.M.; Defaye, A.B.; Bates, L., The effect of pH on the volatiles formed in an extruded starch-glucose-lysine model system, Food Chem., 1997, 58, 4, 323-327, https://doi.org/10.1016/S0308-8146(96)00171-9 . [all data]

Specht and Baltes, 1994
Specht, K.; Baltes, W., Identification of volatile flavor compounds with high aroma values from shallow-fried beef, J. Agric. Food Chem., 1994, 42, 10, 2246-2253, https://doi.org/10.1021/jf00046a031 . [all data]

Zhang, Dorjpalam, et al., 1992
Zhang, Y.; Dorjpalam, B.; Ho, C.-T., Contribution of peptides to volatile formation in the Maillard reaction of casein hydrolysate with glucose, J. Agric. Food Chem., 1992, 40, 12, 2467-2471, https://doi.org/10.1021/jf00024a026 . [all data]

Misharina, Golovnya, et al., 1991
Misharina, T.A.; Golovnya, R.V.; Yakovleva, V.N.; Vitt, S.V., Pyrazines formed in model glycerin-water systems, Russ. Chem. Bull. (Engl. Transl.), 1991, 40, 9, 1742-1748, https://doi.org/10.1007/BF00960396 . [all data]

Zhang and Ho, 1991
Zhang, Y.; Ho, C.-T., Comparison of the volatile compounds formed from the thermal reaction of glucose with cysteine and glutathione, J. Agric. Food Chem., 1991, 39, 4, 760-763, https://doi.org/10.1021/jf00004a029 . [all data]

Majcher and Jelen, 2007
Majcher, M.A.; Jelen, H.H., Effect of Cysteine and Cystine Addition on Sensory Profile and Potent Odorants of Extruded Potato Snacks, J. Agric. Food Chem., 2007, 55, 14, 5754-5760, https://doi.org/10.1021/jf0703147 . [all data]

Frauendorfer and Schieberle, 2006
Frauendorfer, F.; Schieberle, P., Identification of the key aroma compounds in Cocoa powder based on molecular sensoly correlations, J. Agr. Food Chem., 2006, 54, 15, 5521-5529, https://doi.org/10.1021/jf060728k . [all data]

Lu, Hao, et al., 2005
Lu, C.-Y.; Hao, Z.; Payne, R.; Ho, C.-T., Effects of water content on volatile generation and peptide degradation in the Maillard reaction of glycine, diglycine, and triglycine, J. Agric. Food Chem., 2005, 53, 16, 6443-6447, https://doi.org/10.1021/jf050534p . [all data]

Majcher and Jelén, 2005
Majcher, M.A.; Jelén, H.H., Identification of potent odorants formed during the preparation of extruded potato snacks, J. Agric. Food Chem., 2005, 53, 16, 6432-6437, https://doi.org/10.1021/jf050412x . [all data]

Duckham, Dodson, et al., 2001
Duckham, S.C.; Dodson, A.T.; Bakker, J.; Ames, J.M., Volatile flavour components of baked potato flesh. A comparison of eleven potato cultivars, Nahrung/Food, 2001, 45, 5, 317-323, https://doi.org/10.1002/1521-3803(20011001)45:5<317::AID-FOOD317>3.0.CO;2-4 . [all data]

Rychlik and Bosset, 2001
Rychlik, M.; Bosset, J.O., Flavour and off-flavour compoundsof SwissGruy ere cheese. Evaluation of potent odorants, Int. Dairy J., 2001, 11, 11-12, 895-901, https://doi.org/10.1016/S0958-6946(01)00108-X . [all data]

Parker, Hassell, et al., 2000
Parker, J.K.; Hassell, G.M.E.; Mottram, D.S.; Guy, R.C.E., Sensory and instrumental analyses of volatiles generated during the extrusion cooking of oat flours, J. Agric. Food Chem., 2000, 48, 8, 3497-3506, https://doi.org/10.1021/jf991302r . [all data]

Tairu, Hofmann, et al., 2000
Tairu, A.O.; Hofmann, T.; Schieberle, P., Studies on the key odorants formed by roasting of wild mango seeds (Irvingia gabonensis), J. Agric. Food Chem., 2000, 48, 6, 2391-2394, https://doi.org/10.1021/jf990765u . [all data]

Bredie, Mottram, et al., 1998
Bredie, W.L.P.; Mottram, D.S.; Guy, R.C.E., Aroma volatiles generated during extrusion cooking of maize flour, J. Agric. Food Chem., 1998, 46, 4, 1479-1487, https://doi.org/10.1021/jf9708857 . [all data]

Fickert and Schieberle, 1998
Fickert, B.; Schieberle, P., Identification of the key odorants in barley malt (caramalt) using GC/MS techniques and odour dilution analyses, Nahrung, 1998, 42, 6, 371-375, https://doi.org/10.1002/(SICI)1521-3803(199812)42:06<371::AID-FOOD371>3.0.CO;2-V . [all data]

Hofmann and Schieberle, 1998
Hofmann, T.; Schieberle, P., Identification of key aroma compounds generated from cysteine and carbohydrates under roasting conditions, Z. Lebensm. Unters. Forsch. A, 1998, 207, 3, 229-236, https://doi.org/10.1007/s002170050324 . [all data]

Münch, Hofmann, et al., 1997
Münch, P.; Hofmann, T.; Schieberle, P., Comparison of key odorants generated by thermal treatment of commercial and self-prepared yeast extracts: influence of the amino acid composition on odorant formation, J. Agric. Food Chem., 1997, 45, 4, 1338-1344, https://doi.org/10.1021/jf960658p . [all data]

Owens J.D., Allagheny N., et al., 1997
Owens J.D.; Allagheny N.; Kipping G.; Ames J.M., Formation of volatile compounds during Bacillus subtilis fermentation of soya beans, J. Sci. Food Agric., 1997, 74, 1, 132-140, https://doi.org/10.1002/(SICI)1097-0010(199705)74:1<132::AID-JSFA779>3.0.CO;2-8 . [all data]

Kuo, Zhang, et al., 1989
Kuo, M.-C.; Zhang, Y.; Hartman, T.G.; Rosen, R.T.; Ho, C.-T., Selective purge-and-trap method for the analysis of volatile pyrazines, J. Agric. Food Chem., 1989, 37, 4, 1020-1022, https://doi.org/10.1021/jf00088a045 . [all data]

Pozo-Bayon M.A., Ruiz-Rodriguez A., et al., 2007
Pozo-Bayon M.A.; Ruiz-Rodriguez A.; Pernin K.; Cayot N., Influence of eggs on the aroma composition of a sponge cake and on the aroma release in model studies on flavored sponge cakes, J. Agric. Food Chem., 2007, 55, 4, 1418-1426, https://doi.org/10.1021/jf062203y . [all data]

Lopez-Galilea I., Fournier N., et al., 2006
Lopez-Galilea I.; Fournier N.; Cid C.; Guichard E., Changes in headspace volatile concentrations of coffee brews caused by the roasting process and the brewing procedure, J. Agric. Food Chem., 2006, 54, 22, 8560-8566, https://doi.org/10.1021/jf061178t . [all data]

Stephan and Steinhart, 1999
Stephan, A.; Steinhart, H., Identification of character impact odorants of different soybean lecithins, J. Agric. Food Chem., 1999, 47, 7, 2854-2859, https://doi.org/10.1021/jf981387g . [all data]

Shimoda, Nakada, et al., 1997
Shimoda, M.; Nakada, Y.; Nakashima, M.; Osajima, Y., Quantitative comparison of volatile flavor compounds in deep-roasted and light-roasted sesame seed oil, J. Agric. Food Chem., 1997, 45, 8, 3193-3196, https://doi.org/10.1021/jf970172o . [all data]

Shimoda, Shiratsuchi, et al., 1996
Shimoda, M.; Shiratsuchi, H.; Nakada, Y.; Wu, Y.; Osajima, Y., Identification and sensory characterization of volatile flavor compounds in sesame seed oil, J. Agric. Food Chem., 1996, 44, 12, 3909-3912, https://doi.org/10.1021/jf960115f . [all data]

Cadwallader, Tan, et al., 1995
Cadwallader, K.R.; Tan, Q.; Chen, F.; Meyers, S.P., Evaluation of the aroma of cooked spiny lobster tail meat by aroma extract dilution analysis, J. Agric. Food Chem., 1995, 43, 9, 2432-2437, https://doi.org/10.1021/jf00057a022 . [all data]

Tanchotikul and Hsieh, 1989
Tanchotikul, U.; Hsieh, T.C.-Y., Volatile Flavor Components in Crayfish Waste, J. Food Sci., 1989, 54, 6, 1515-1520, https://doi.org/10.1111/j.1365-2621.1989.tb05149.x . [all data]

Salter L.J., Mottram D.S., et al., 1988
Salter L.J.; Mottram D.S.; Whitfield, Volatile compounds produces in Maillard reactions involving glycine, ribose and phospholid, J. Sci. Food Agric., 1988, 46, 2, 227-242, https://doi.org/10.1002/jsfa.2740460211 . [all data]

Whitfield, Mottram, et al., 1988
Whitfield, F.B.; Mottram, D.S.; Brock, S.; Puckey, D.J.; Salter, L.J., Effect of Phospholipid on the Formation of Volatile Heterocyclic Compounds in Heated Aqueous Solutions of Amino Acids and Ribose, J. Sci. Food Agric., 1988, 42, 3, 261-272, https://doi.org/10.1002/jsfa.2740420309 . [all data]

Bianchi, Careri, et al., 2007
Bianchi, F.; Careri, M.; Mangia, A.; Musci, M., Retention indices in the analysis of food aroma volatile compounds in temperature-programmed gas chromatography: Database creation and evaluation of precision and robustness, J. Sep. Sci., 2007, 39, 4, 563-572, https://doi.org/10.1002/jssc.200600393 . [all data]

Alasalvar, Shahidi, et al., 2003
Alasalvar, C.; Shahidi, F.; Cadwallader, K.R., Comparison of natural and roasted Turkish Tombul hazelnut (Corylus avellana L.) volatiles and flavor by DHA/GC/MS and descriptive sensory analysis, J. Agric. Food Chem., 2003, 51, 17, 5067-5072, https://doi.org/10.1021/jf0300846 . [all data]

Rhlid, Fleury, et al., 2002
Rhlid, R.B.; Fleury, Y.; Blank, I.; Fay, L.B.; Welti, D.H.; Vera, F.A.; Juillerat, M.A., Generation of roasted notes based on 2-acetyl-2-thiazoline and its precursor, 2-(1-hydroxyethyl)-4,5-dihydrothiazole, by combined bio and thermal approaches, J. Agric. Food Chem., 2002, 50, 8, 2350-2355, https://doi.org/10.1021/jf011170d . [all data]

Baek and Cadwallader, 1996
Baek, H.H.; Cadwallader, K.R., Volatile compounds in flavor concentrates produced from crayfish-processing byproducts with and without protease treatment, J. Agric. Food Chem., 1996, 44, 10, 3262-3267, https://doi.org/10.1021/jf960023q . [all data]

Amrani-Hemaimi, Cerny, et al., 1995
Amrani-Hemaimi, M.; Cerny, C.; Fay, L.B., Mechanisms of formation of alkylpyrazines in the Maillard reaction, J. Agric. Food Chem., 1995, 43, 11, 2818-2822, https://doi.org/10.1021/jf00059a009 . [all data]

Chen, Song, et al., 2009
Chen, G.; Song, H.; Ma, C., Aroma-active aompounds of Beijing roast duck, Flavour Fragr. J., 2009, 24, 4, 186-191, https://doi.org/10.1002/ffj.1932 . [all data]

Risticevic, Carasek, et al., 2008
Risticevic, S.; Carasek, E.; Pawliszyn, J., Headspace solid-phase microextraction-gas chromatographic-time-of-flight mass spectrometric methodology for geographical origin verification of coffee, Anal. Chim. Acta, 2008, 617, 1-2, 72-84, https://doi.org/10.1016/j.aca.2008.04.009 . [all data]

Fadel, Mageed, et al., 2006
Fadel, H.H.M.; Mageed, M.A.A.; Lotfy, S.N., Quality and flavour stability of coffee substitute prepared by extrusion of wheat germ and chicory roots, Amino Acids, 2006, https://doi.org/10.1007/s007260200008 . [all data]

Schirack, Drake, et al., 2006
Schirack, A.V.; Drake, M.A.; Sander, T.H.; Sandeep, K.P., Characterization of aroma-active compounds in microwave blanched peanuts, J. Food Sci., 2006, 71, 9, c513-c520, https://doi.org/10.1111/j.1750-3841.2006.00173.x . [all data]

Leffingwell and Alford, 2005
Leffingwell, J.C.; Alford, E.D., Volatile constituents of Perique tobacco, Electron. J. Environ. Agric. Food Chem., 2005, 4, 2, 899-915. [all data]

van Loon, Linssen, et al., 2005
van Loon, W.A.M.; Linssen, J.P.H.; Legger, A.; Posthumus, M.A.; Voragen, A.G.J., Identification and olfactometry of French fries flavour extracted at mouth conditions, Food Chem., 2005, 90, 3, 417-425, https://doi.org/10.1016/j.foodchem.2004.05.005 . [all data]

Sanz, Czerny, et al., 2002
Sanz, C.; Czerny, M.; Cid, C.; Schieberle, P., Comparison of potent odorants in a filtered coffee brew and in an instant coffee beverage by aroma extract dilution analysis (AEDA), Eur. Food Res. Technol., 2002, 214, 4, 299-302, https://doi.org/10.1007/s00217-001-0459-9 . [all data]

Cadwallader and Heo, 2001
Cadwallader, K.R.; Heo, J., Aroma of roasted sesame oil: characterization by direct thermal desorption-gas chromatography-olfactometry and sample dilution analysis, Am. Chem. Soc. Symp. Ser., 2001, 782, 187-202. [all data]

Welty, Marshall, et al., 2001
Welty, W.M.; Marshall, R.T.; Grün, I.U.; Ellersieck, M.R., Effects of Milk Fat, Cocoa Butter, or Selected Fat Replacers on Flavor Volatiles of Chocolate Ice Cream, J. Dairy Sci., 2001, 84, 1, 21-30, https://doi.org/10.3168/jds.S0022-0302(01)74447-5 . [all data]

Boylston and Viniyard, 1998
Boylston, T.D.; Viniyard, B.T., Isolation of volatile flavor compounds from peanut butter using purge-and-trap technique in Instrumental Methods in Food and Beverage Analysis, D. Wetzel and G. Charalambous, ed(s)., 1998, 225-243. [all data]

Deibler, Acree, et al., 1998
Deibler, K.D.; Acree, T.E.; Lavin, E.H., Aroma analysis of coffrr brew by gas chromatography-oldfactometry, Developments in Food Sci., 1998, 40, 69-78. [all data]

Buttery, Ling, et al., 1997
Buttery, R.G.; Ling, L.C.; Stern, D.J., Studies on popcorn aroma and flavor volatiles, J. Agric. Food Chem., 1997, 45, 3, 837-843, https://doi.org/10.1021/jf9604807 . [all data]

Farkas, Sádecká, et al., 1997
Farkas, P.; Sádecká, J.; Kovác, M.; Siegmund, B.; Leitner, E.; Pfannhauser, W., Key odourants of pressure-cooked hen meat, Food Chem., 1997, 60, 4, 617-621, https://doi.org/10.1016/S0308-8146(97)00042-3 . [all data]

Lu, Yu, et al., 1997
Lu, G.; Yu, T.-H.; Ho, C.-T., Generation of flavor compounds by the reaction of 2-deoxyglucose with selected amino acids, J. Agric. Food Chem., 1997, 45, 1, 233-236, https://doi.org/10.1021/jf960609c . [all data]

Yu and Ho, 1995
Yu, T.-H.; Ho, C.-T., Volatile compounds generated from thermal reaction of methionine and methionine sulfoxide with or without glucose, J. Agric. Food Chem., 1995, 43, 6, 1641-1646, https://doi.org/10.1021/jf00054a043 . [all data]

Yu, Wu, et al., 1994
Yu, T.-H.; Wu, C.-M.; Ho, C.-T., Meat-like flavor generated from thermal interactions of glucose and alliin or deoxyalliin, J. Agric. Food Chem., 1994, 42, 4, 1005-1009, https://doi.org/10.1021/jf00040a032 . [all data]

Mihara and Masuda, 1987
Mihara, S.; Masuda, H., Correlation between molecular structures and retention indices of pyrazines, J. Chromatogr., 1987, 402, 309-317, https://doi.org/10.1016/0021-9673(87)80029-8 . [all data]

Wu, Liou, et al., 1987
Wu, C.-M.; Liou, S.-E.; Chang, Y.-H.; Chiang, W., Volatile compounds of the wax gourd (Benincasa hispida, Cogn) and a wax gourd beverage, J. Food Sci., 1987, 52, 1, 132-134, https://doi.org/10.1111/j.1365-2621.1987.tb13988.x . [all data]

Lorenz, Stern, et al., 1983
Lorenz, G.; Stern, D.J.; Flath, R.A.; Haddon, W.F.; Tillin, S.J.; Teranishi, R., Identification of sheep liver volatiles, J. Agric. Food Chem., 1983, 31, 5, 1052-1057, https://doi.org/10.1021/jf00119a033 . [all data]

Heydanek and McGorrin, 1981
Heydanek, M.G.; McGorrin, R.J., Gas chromatography-mass spectroscopy investigations on the flavor chemistry of oat groats, J. Agric. Food Chem., 1981, 29, 5, 950-954, https://doi.org/10.1021/jf00107a016 . [all data]

Yu and Zhang, 2010
Yu, A.-N.; Zhang, A.-D., The effect of pH on the total formation of aroma compounds produced by hearting a model system containing L-ascorbic acid with L-threonine/L-serine, Food Chem., 2010, 119, 1, 214-219, https://doi.org/10.1016/j.foodchem.2009.06.026 . [all data]

Frauendorfer and Schieberle, 2008
Frauendorfer, F.; Schieberle, P., Changes in key aroma compounds of criollo cocoa beans during roasting, J. Agric. Food Chem., 2008, 56, 21, 10244-10251, https://doi.org/10.1021/jf802098f . [all data]

Wan Aida, Ho, et al., 2008
Wan Aida, W.M.; Ho, C.W.; Maskat, M.Y.; Osman, H., Relating descriptive sensory analysis to gas chromatography / mass spectrometry of palm sugars using partial least squares regression, ASEAN Food J., 2008, 15, 1, 35-45. [all data]

Characterization of Pyrazines in Some Chinese Liquors and Their Approximate Concentrations, 2007
Characterization of Pyrazines in Some Chinese Liquors; Their Approximate Concentrations, W. Fan; Y. Xu; Y. Zhang, J. Agric. Food Chem., 2007, 55, 9956-9962. [all data]

Ho, Wan Aida, et al., 2007
Ho, C.W.; Wan Aida, W.M.; Maskat, M.Y.; Osman, H., Changes in volatile compounds of palm sap (Arenga pinnata) during the heating process for production of palm sugar, Food Chem., 2007, 102, 4, 1156-1162, https://doi.org/10.1016/j.foodchem.2006.07.004 . [all data]

Lasekan, Buettner, et al., 2007
Lasekan, O.; Buettner, A.; Christlbauer, M., Investigation of important odorants of palm wine (Elaeis guineensis), Food Chem., 2007, 105, 1, 15-23, https://doi.org/10.1016/j.foodchem.2006.12.052 . [all data]

Bailly, Jerkovic, et al., 2006
Bailly, S.; Jerkovic, V.; Marchand-Brynaert, J.; Collin, S., Aroma Extraction Dilution Analysis of Sauternes Wines. Key Role of Polyfunctional Thiols, J. Agric. Food Chem., 2006, 54, 19, 7227-7234, https://doi.org/10.1021/jf060814k . [all data]

Carpino, Mallia, et al., 2004
Carpino, S.; Mallia, S.; Licitra, G.; van Soest, P.J.; Acree, T.E., Aroma compounds of some Hyblean pasture species, Flavour Fragr. J., 2004, 19, 4, 293-297, https://doi.org/10.1002/ffj.1346 . [all data]

Counet, Ouwerx, et al., 2004
Counet, C.; Ouwerx, C.; Rosoux, D.; Collin, S., Relationship between procyanidin and flavor contents of cocoa liquors from different origins, J. Agric. Food Chem., 2004, 52, 20, 6243-6249, https://doi.org/10.1021/jf040105b . [all data]

Bücking and Steinhart, 2002
Bücking, M.; Steinhart, H., Headspace GC and sensory analysis characterization of the influence of different milk additives on the flavor release of coffee beverages, J. Agric. Food Chem., 2002, 50, 6, 1529-1534, https://doi.org/10.1021/jf011117p . [all data]

Counet, Callemien, et al., 2002
Counet, C.; Callemien, D.; Ouwerx, C.; Collin, S., Use of gas chromatography-olfactometry to identify key odorant compounds in dark chocolate. Comparison of samples before and after conching, J. Agric. Food Chem., 2002, 50, 8, 2385-2391, https://doi.org/10.1021/jf0114177 . [all data]

Masanetz, Guth, et al., 1998
Masanetz, C.; Guth, H.; Grosch, W., Fishy and hay-like off-flavours of dry spinach, Z. Lebensm. Unters. Forsch. A, 1998, 206, 2, 108-113, https://doi.org/10.1007/s002170050224 . [all data]

Matsui, Guth, et al., 1998
Matsui, T.; Guth, H.; Grosch, W., A comparative study of potent odorants in peanut, hazelnut, and pumpkin seed oils on the basis of aroma extract dilution analysis (AEDA) and gas chromatography-olfactometry of headspace samples (GCOH), Lipid - Fett, 1998, 100, 2, 51-56, https://doi.org/10.1002/(SICI)1521-4133(199802)100:2<51::AID-LIPI51>3.0.CO;2-W . [all data]

Zehentbauer and Grosch, 1998
Zehentbauer, G.; Grosch, W., Crust aroma of baguettes. I. Key odorants of baguettes prepared in two different ways, J. Cereal Science, 1998, 28, 1, 81-92, https://doi.org/10.1006/jcrs.1998.0184 . [all data]

Schermann and Schieberle, 1997
Schermann, P.; Schieberle, P., Evaluation of key odorants in milk chocolate and cocoa mass by aroma extract dilution analyses, J. Agric. Food Chem., 1997, 45, 3, 867-872, https://doi.org/10.1021/jf960670h . [all data]

Schieberle, 1996
Schieberle, P., Odour-active compounds in moderately roasted sesame, Food Chem., 1996, 55, 2, 145-152, https://doi.org/10.1016/0308-8146(95)00095-X . [all data]

Schieberle and Grosch, 1994
Schieberle, P.; Grosch, W., Potent odorants of rye bread crust - differences from the crumb and from wheat bread crust, Z. Lebensm. Unters. Forsch., 1994, 198, 4, 292-296, https://doi.org/10.1007/BF01193177 . [all data]

Guth and Grosch, 1993
Guth, H.; Grosch, W., 12-Methyltridecanal, a species-specific odorant of stewed beef, Lebensm. Wiss. Technol., 1993, 26, 2, 171-177, https://doi.org/10.1006/fstl.1993.1035 . [all data]

Blank, Sen, et al., 1992
Blank, I.; Sen, A.; Grosch, W., Potent odorants of the roasted powder and brew of Arabica coffee, Z. Lebensm. Unters Forsch., 1992, 195, 3, 239-245, https://doi.org/10.1007/BF01202802 . [all data]

Kawai, Ishida, et al., 1991
Kawai, T.; Ishida, Y.; Kakiuchi, H.; Ikeda, N.; Higashida, T.; Nakamura, S., Flavor components of dried squid, J. Agric. Food Chem., 1991, 39, 4, 770-777, https://doi.org/10.1021/jf00004a031 . [all data]

Puvipirom and Chaisei, 2012
Puvipirom, J.; Chaisei, S., Contribution of roasted grains and seeds in aroma of oleang (Thai coffee drink), Int. Food Res. J., 2012, 19, 2, 583-588. [all data]

Onishi, Inoue, et al., 2011
Onishi, M.; Inoue, M.; Araki, T.; Iwabuchi, H.; Sagara, Y., Odorant transfer characteristics of white bread during baking, Biosci Biotechnol. Biochem., 2011, 75, 2, 261-267, https://doi.org/10.1271/bbb.100572 . [all data]

Kumazawa, Sakai, et al., 2010
Kumazawa, K.; Sakai, N.; Amma, H.; Sakamoto, S.; Kodama, M.; Wada, Y.; Nishimura, O., Identification and formation of volatile components responsible for the characteristic aroma of Mat Rush (Igusa), Biosci. Biotechnol. Biochem., 2010, 74, 6, 1231-1236, https://doi.org/10.1271/bbb.100053 . [all data]

Rochat, Egger, et al., 2009
Rochat, S.; Egger, J.; Chaintreau, A., Strategy for the identification of key odorants: application to shrimp aroma, J. Chromatogr. A, 2009, 1216, 36, 6424-6432, https://doi.org/10.1016/j.chroma.2009.07.014 . [all data]

Ishizaki, Tachihara, et al., 2005
Ishizaki, S.; Tachihara, T.; Tamura, H.; Yanai, T.; Kitahara, T., Evaluation of odour-active compounds in roasted shrimp (Sergia lucens Hansen) by aroma extract dilution analysis, Flavour Fragr. J., 2005, 20, 6, 562-566, https://doi.org/10.1002/ffj.1484 . [all data]

Kumazawa, Kubota, et al., 2005
Kumazawa, K.; Kubota, K.; Masuda, H., Influence of Manufacturing Conditions and Crop Season on the Formation of 4-Mercapto-4-methyl-2-pentanone in Japanese Green Tea (Sen-cha), J. Agric. Food Chem., 2005, 53, 13, 5390-5396, https://doi.org/10.1021/jf050392z . [all data]

Ishikawa, Ito, et al., 2004
Ishikawa, M.; Ito, O.; Ishizaki, S.; Kurobayashi, Y.; Fujita, A., Solid-phase aroma concentrate extraction (SPACE ): a new headspace technique for more sensitive analysis of volatiles, Flavour Fragr. J., 2004, 19, 3, 183-187, https://doi.org/10.1002/ffj.1322 . [all data]

Akiyama, Murakami, et al., 2003
Akiyama, M.; Murakami, K.; Ohtani, N.; Iwatsuki, K.; Sotoyama, K.; Wada, A.; Tokuno, K.; Iwabuchi, H.; Tanaka, K., Analysis of volatile compounds released during the grinding of roasted coffee beans using solid-phase microextraction, J. Agric. Food Chem., 2003, 51, 7, 1961-1969, https://doi.org/10.1021/jf020724p . [all data]

Andueza, Maeztu, et al., 2003
Andueza, S.; Maeztu, L.; Pascual, L.; Ibanez, C.; de Pena M.P.; Cid, C., Influence of extraction temperature on the final quality of espresso coffee, J. Sci. Food Agric., 2003, 83, 3, 240-248, https://doi.org/10.1002/jsfa.1304 . [all data]

Andueza, de Peña, et al., 2003
Andueza, S.; de Peña, M.P.; Cid, C., Chemical and sensorial characteristics of espresso coffee as affected by grinding and torrefacto roast, J. Agric. Food Chem., 2003, 51, 24, 7034-7039, https://doi.org/10.1021/jf034628f . [all data]

Kumazawa and Masuda, 2002
Kumazawa, K.; Masuda, H., Identification of potent odorants in different green tea varieties using flavor dilution technique, J. Agric. Food Chem., 2002, 50, 20, 5660-5663, https://doi.org/10.1021/jf020498j . [all data]

Maeztu, Sanz, et al., 2001
Maeztu, L.; Sanz, C.; Andueza, S.; de Peña, M.P.; Bello, J.; Cid, C., Characterization of espresso coffee aroma by static headspace GC-MS and sensory flavor profile, J. Agric. Food Chem., 2001, 49, 11, 5437-5444, https://doi.org/10.1021/jf0107959 . [all data]

Kim, Baek, et al., 2000
Kim, D.S.; Baek, H.H.; Ahn, C.B.; Byun, D.S.; Jung, K.J.; Lee, H.G.; Cadwallader, K.R.; Kim, H.R., Development and characterization of a flavoring agent from oyster cooker effluent, J. Agric. Food Chem., 2000, 48, 10, 4839-4843, https://doi.org/10.1021/jf991096n . [all data]

Buttery, Orts, et al., 1999
Buttery, R.G.; Orts, W.J.; Takeoka, G.R.; Nam, Y., Volatile flavor components of rice cakes, J. Agric. Food Chem., 1999, 47, 10, 4353-4356, https://doi.org/10.1021/jf990140w . [all data]

Kumazawa and Masuda, 1999
Kumazawa, K.; Masuda, H., Identification of potent odorants in Japanese green tea (Sen-cha), J. Agric. Food Chem., 1999, 47, 12, 5169-5172, https://doi.org/10.1021/jf9906782 . [all data]

Buttery and Ling, 1998
Buttery, R.G.; Ling, L.C., Additional studies on flavor components of corn tortilla chips, J. Agric. Food Chem., 1998, 46, 7, 2764-2769, https://doi.org/10.1021/jf980125b . [all data]

Chyau, Lin, et al., 1997
Chyau, C.-C.; Lin, Y.-C.; Mau, J.-L., Storage stability of deep-fried shallot flavoring, J. Agric. Food Chem., 1997, 45, 8, 3211-3215, https://doi.org/10.1021/jf970109z . [all data]

Umano, Hagi, et al., 1995
Umano, K.; Hagi, Y.; Nakahara, K.; Shyoji, A.; Shibamoto, T., Volatile chemicals formed in the headspace of a heated D-glucose/L-cysteine Maillard model system, J. Agric. Food Chem., 1995, 43, 8, 2212-2218, https://doi.org/10.1021/jf00056a046 . [all data]

Vernin, Metzger, et al., 1988
Vernin, G.; Metzger, J.; Obretenov, T.; Suon, K.-N.; Fraisse, D., GC/MS (EI,PCI,SIM)-data bank analysis of volatile compounds arising from thermal degradation of glucose-valine amadori intermediates in Flavors and Fragrances: A World Perspective. Proceedings of the 10th International Congress of Essential Oils, Fragrances and Flavors, Lawrence,B.M.; Mookherjee,B.D.; Willis,B.J., ed(s)., Elsevier, New York, 1988, 999-1028. [all data]

Wong and Bernhard, 1988
Wong, J.M.; Bernhard, R.A., Effect of nitrogen source on pyrazine formation, J. Agric. Food Chem., 1988, 36, 1, 123-129, https://doi.org/10.1021/jf00079a032 . [all data]

Schieberle and Grosch, 1983
Schieberle, P.; Grosch, W., Identifizierung von Aromastoffen aus der Kruste von Roggenbrot, Z. Lebensm. Unters. Forsch., 1983, 177, 3, 173-180, https://doi.org/10.1007/BF01146791 . [all data]

Liardon and Ledermann, 1980
Liardon, R.; Ledermann, S., volatile components of fermented soya hydrolysate. II. Composition of basic fraction, Z. Lebensm. Unters. Forsch., 1980, 170, 3, 208-213, https://doi.org/10.1007/BF01042542 . [all data]

Shibamoto and Russell, 1977
Shibamoto, T.; Russell, G.F., A study of the volatiles isolated from a D-glucose-hydrogen sulfide-ammonia model system, J. Agric. Food Chem., 1977, 25, 1, 109-112, https://doi.org/10.1021/jf60209a054 . [all data]

Delabre and Bendall, 9999
Delabre, M.-L.; Bendall, J.F., Flavour ingredients from fermented dairy streams, Expression of Multidisciplinary Flavour Sci., 9999, 375-378. [all data]

Kraft and Switt, 2005
Kraft, P.; Switt, K.A.D. (Eds), Perspectives in Flavor and Fragrance Research, Wiley-VCH, Weinheim, Germany, 2005, 251. [all data]

Didzbalis, Ritter, et al., 2004
Didzbalis, J.; Ritter, K.A.; Trail, A.C.; Plog, F.J., Identification of fruity/fermented odorants in high-temperature-cured roasted peanuts, J. Agric. Food Chem., 2004, 52, 15, 4828-4833, https://doi.org/10.1021/jf0355250 . [all data]

Ito and Mori, 2004
Ito, K.; Mori, M., Formation of pyrazines in aqueous maltose/glucose/fructose-glutamide model systems upon heating at below 100 0C, Food Sci. Technol. Res., 2004, 10, 2, 199-204, https://doi.org/10.3136/fstr.10.199 . [all data]

Tachihara, Ishizaki, et al., 2004
Tachihara, T.; Ishizaki, S.; Ishikawa, M.; Kitahara, T., Studies on the volatile compounds of roasted spotted shrimp, Chemistry Biodiversity, 2004, 1, 12, 2024-2033, https://doi.org/10.1002/cbdv.200490155 . [all data]

Baek and Cadwallader, 2003
Baek, H.H.; Cadwallader, K.R., Gas chromatographic/olfactometric evaluation of flavor extracts produced from crawfish processing by-products, 2003, retrieved from http://nsgl.gso.uri.edu/source/flsgpw95001/flsgpw95001part5.pdf. [all data]

Bel Rhild, Fleury, et al., 2002
Bel Rhild, R.; Fleury, Y.; Devaud, S.; Fay, L.B.; Blank, I.; Juillerat, M.A., Biogeneration of roasted noted based on 2-acetyl-2-thiazoline and the precursor 2-(1-hydroxyethyl)-4,5-dihydrothiazole, 2002, retrieved from http://www.imrablank.ch/ACS2002826179.pdf. [all data]

Bel Rhild, Fleury, et al., 2002, 2
Bel Rhild, R.; Fleury, Y.; Blank, I.; Fay, L.B.; Welti, D.H.; Vera F.A.; Juillerat, M.A., Generation of roasted notes based on 2-acetyl-2-thiazolidine and its precursor, 2-(1-hydroxyethyl)-4,5-dihydrothiazoline, by combined bio and thermal approaches, J. Agr. Food Chem., 2002, 50, 8, 2350-2355, https://doi.org/10.1021/jf011170d . [all data]

Mayer and Grosch, 2001
Mayer, F.; Grosch, W., Aroma simulation on the basis of the odourant composition of roasted coffee headspace, Flavour Fragr. J., 2001, 16, 3, 180-190, https://doi.org/10.1002/ffj.975 . [all data]