8-Decene-3,5-dione, 4,6,9-trimethyl-

Van Den Dool and Kratz RI, non-polar column, temperature ramp

View large format table.

Column type Active phase I Reference Comment
CapillaryRTX-11415.Paolini J., Desjobert J.M., et al., 200660. m/0.22 mm/0.25 μm, He, 2. K/min, 230. C @ 35. min; Tstart: 60. C
CapillaryBP-11417.Bianchini, Tomi, et al., 200350. m/0.22 mm/0.25 μm, He, 2. K/min, 230. C @ 35. min; Tstart: 60. C
CapillaryBP-11417.Bianchini, Tomi, et al., 200150. m/0.22 mm/0.25 μm, He, 2. K/min, 230. C @ 35. min; Tstart: 60. C

Van Den Dool and Kratz RI, non-polar column, custom temperature program

View large format table.

Column type Active phase I Reference Comment
CapillaryHP-5MS1449.1Andriamaharavo, 201430. m/0.25 mm/0.25 μm, He; Program: 60C (1 min) => 5 C/min => 210C => 10 C/min => 280C (15 min)

Van Den Dool and Kratz RI, polar column, temperature ramp

View large format table.

Column type Active phase I Reference Comment
CapillaryRTX-Wax1865.Paolini J., Desjobert J.M., et al., 200660. m/0.22 mm/0.25 μm, He, 2. K/min, 230. C @ 35. min; Tstart: 60. C
CapillaryBP-201882.Bianchini, Tomi, et al., 200350. m/0.22 mm/0.25 μm, He, 2. K/min, 230. C @ 35. min; Tstart: 60. C
CapillaryBP-201882.Bianchini, Tomi, et al., 200150. m/0.22 mm/0.25 μm, He, 2. K/min, 230. C @ 35. min; Tstart: 60. C

References

Paolini J., Desjobert J.M., et al., 2006
Paolini J.; Desjobert J.M.; Costa J.; Bernardini A.F.; Castellini C.B.; Cioni P.L.; Flamini G.; Morelli I., Composition of essential oils of Helichrysum italicum (Roth) G. Don fil subsp. italicum from Tuscan archipelago islands, Flavour Fragr. J., 2006, 21, 5, 805-808, https://doi.org/10.1002/ffj.1726 . [all data]

Bianchini, Tomi, et al., 2003
Bianchini, A.; Tomi, P.; Bernardini, A.F.; Morelli, I.; Flamini, G.; Cioni, P.L.; Usai, M.; Marchetti, M., A comparative study of volatile constituents of two Helichrysum italicum (Roth) Guss. Don Fil subspecies growing in Corsica (France), Tuscany and Sardinia (Italy), Flavour Fragr. J., 2003, 18, 6, 487-491, https://doi.org/10.1002/ffj.1231 . [all data]

Bianchini, Tomi, et al., 2001
Bianchini, A.; Tomi, P.; Costa, J.; Bernardini, A.F., Composition of Helichrysum italicum (Roth) G. Don fil. subsp. italicum essential oils from Corsica (France), Flavour Fragr. J., 2001, 16, 1, 30-34, https://doi.org/10.1002/1099-1026(200101/02)16:1<30::AID-FFJ941>3.0.CO;2-F . [all data]

Andriamaharavo, 2014
Andriamaharavo, N.R., Retention Data. NIST Mass Spectrometry Data Center., NIST Mass Spectrometry Data Center, 2014. [all data]