Cyclohexane, 1-methyl-3-(1-methylethylidene)-

Phase change data

Data compiled by: Thermodynamics Research Center, NIST Boulder Laboratories, Chris Muzny director

Quantity Value Units Method Reference Comment
Tboil447.KN/AWallach and Churchill, 1908Uncertainty assigned by TRC = 6. K
Tboil448.KN/AWallach, 1908Uncertainty assigned by TRC = 7. K

In addition to the Thermodynamics Research Center (TRC) data available from this site, much more physical and chemical property data is available from the following TRC products:

References

Wallach and Churchill, 1908
Wallach, O.; Churchill, J.B., Knowledge of Terpenes and Essential Oils. IX. Condensation of 1,3-Methylcyclohexanone with Bromoisobutyric Acid Ester, Justus Liebigs Ann. Chem., 1908, 360, 75-9. [all data]

Wallach, 1908
Wallach, O., Knowledge of Terpenes and Essential Oils, Justus Liebigs Ann. Chem., 1908, 360, 26-44. [all data]