Potassium hexachloroaluminate

Condensed phase thermochemistry data

Quantity Value Units Method Reference Comment
Δfsolid-2092.00kJ/molReviewChase, 1998Data last reviewed in September, 1963
Quantity Value Units Method Reference Comment
solid376.54J/mol*KReviewChase, 1998Data last reviewed in September, 1963

Solid Phase Heat Capacity (Shomate Equation)

Cp° = A + B*t + C*t2 + D*t3 + E/t2
H° − H°298.15= A*t + B*t2/2 + C*t3/3 + D*t4/4 − E/t + F − H
S° = A*ln(t) + B*t + C*t2/2 + D*t3/3 − E/(2*t2) + G
    Cp = heat capacity (J/mol*K)
    H° = standard enthalpy (kJ/mol)
    S° = standard entropy (J/mol*K)
    t = temperature (K) / 1000.

View plot Requires a JavaScript / HTML 5 canvas capable browser.

View table.

Temperature (K) 298. - 2000.
A 202.7361
B 161.6396
C -65.50261
D 9.890098
E 0.317102
F -2158.015
G 578.2957
H -2092.000
ReferenceChase, 1998
Comment Data last reviewed in September, 1963

References

Chase, 1998
Chase, M.W., Jr., NIST-JANAF Themochemical Tables, Fourth Edition, J. Phys. Chem. Ref. Data, Monograph 9, 1998, 1-1951. [all data]