Benzene, 1,2-diethyl-4-methyl-

Kovats' RI, non-polar column, isothermal

Data compiled by: NIST Mass Spectrometry Data Center, William E. Wallace, director

Column type CapillaryCapillaryCapillaryCapillaryCapillary
Active phase OV-1OV-1PONAOV-101OV-101
Column length (m) 52.52.50.50.278.
Carrier gas N2H2H2HeN2
Substrate
Column diameter (mm) 0.250.250.20.200.25
Phase thickness (μm) 0.380.380.5
Temperature (C) 100.100.100.100.120.
I 1154.21153.91154.91154.1150.
ReferenceMatisová and Kurán, 1990Matisová and Kurán, 1990Matisová and Kurán, 1990Matisová, Kovacicová, et al., 1989Matisová, Moravcová, et al., 1988
Comment MSDC-RI MSDC-RI MSDC-RI MSDC-RI MSDC-RI
Column type CapillaryCapillary
Active phase ApolaneOV-101
Column length (m) 200.278.
Carrier gas N2H2
Substrate
Column diameter (mm) 0.250.25
Phase thickness (μm)
Temperature (C) 120.100.
I 1159.1144.
ReferenceMatisová, Moravcová, et al., 1988Matisová, Rukríglová, et al., 1988
Comment MSDC-RI MSDC-RI

Phase change data

Data compiled by: Thermodynamics Research Center, NIST Boulder Laboratories, Chris Muzny director

Quantity Value Units Method Reference Comment
Tboil475.KN/AKunckell and Ulex. G., 1913Uncertainty assigned by TRC = 4. K

In addition to the Thermodynamics Research Center (TRC) data available from this site, much more physical and chemical property data is available from the following TRC products:

Normal alkane RI, polar column, custom temperature program

Data compiled by: NIST Mass Spectrometry Data Center, William E. Wallace, director

Column type Capillary
Active phase Carbowax 20M
Column length (m)
Carrier gas
Substrate
Column diameter (mm)
Phase thickness (μm)
Program not specified
I 1385.
ReferenceIvanciuc, Ivanciuc, et al., 2001
Comment MSDC-RI

References

Matisová and Kurán, 1990
Matisová, E.; Kurán, P., Reproducibility of retention indices measurement of alkylbenzenes on crosslinked methyl silicone phase fused silica capillaries, Chromatographia, 1990, 30, 5/6, 328-332, https://doi.org/10.1007/BF02319717 . [all data]

Matisová, Kovacicová, et al., 1989
Matisová, E.; Kovacicová, E.; Ha, P.T.; Kolek, E.; Engewald, W., Identification of alkylbenzenes up to C12 by capillary gas chromatography-mass spectrometry. II. Retention indices on OV-101 columns and retention-molecular structure correlations, J. Chromatogr., 1989, 475, 2, 113-123, https://doi.org/10.1016/S0021-9673(01)89667-9 . [all data]

Matisová, Moravcová, et al., 1988
Matisová, E.; Moravcová, A.; Krupcík; Cellár, P.; Leclercq, P.A., Problems with the reproducibility of retention data on capillary columns with hydrocarbon C87 as the stationary phase, J. Chromatogr., 1988, 454, 65-71, https://doi.org/10.1016/S0021-9673(00)88602-1 . [all data]

Matisová, Rukríglová, et al., 1988
Matisová, E.; Rukríglová, M.; Krupcík, J.; Kovacicová, E.; Holotík, S., Identification of alkylbenzenes up to C12 by capillary gas chromatography and combined gas chromatography-mass spectrometry. I. OV-101 as stationary phase, J. Chromatogr., 1988, 455, 301-309, https://doi.org/10.1016/S0021-9673(01)82129-4 . [all data]