2-Acetyl-5-methylthiophene

Phase change data

Data compiled as indicated in comments:
BS - Robert L. Brown and Stephen E. Stein
AC - William E. Acree, Jr., James S. Chickos

Quantity Value Units Method Reference Comment
Tboil505.7KN/AWeast and Grasselli, 1989BS
Tboil505. - 506.KN/ABuckingham and Donaghy, 1982BS
Quantity Value Units Method Reference Comment
Tfus298.KN/ABuckingham and Donaghy, 1982BS
Quantity Value Units Method Reference Comment
Δvap62.0 ± 2.6kJ/molCRibeiro da Silva and Santos, 2008AC

Reduced pressure boiling point

Tboil (K) Pressure (bar) Reference Comment
372.20.01Weast and Grasselli, 1989BS
371. - 373.0.01Buckingham and Donaghy, 1982BS

Van Den Dool and Kratz RI, polar column, custom temperature program

Data compiled by: NIST Mass Spectrometry Data Center, William E. Wallace, director

Column type Capillary
Active phase CP-Wax 52CB
Column length (m) 50.
Carrier gas
Substrate
Column diameter (mm) 0.32
Phase thickness (μm) 0.21
Program 0C(5min) => fast => 60C(5min) => 4C/min => 220C(20min)
I 1874.
ReferenceMadruga and Mottram, 1998
Comment MSDC-RI

Normal alkane RI, non-polar column, temperature ramp

Data compiled by: NIST Mass Spectrometry Data Center, William E. Wallace, director

Column type Capillary
Active phase HP-5
Column length (m) 30.
Carrier gas N2
Substrate
Column diameter (mm) 0.25
Phase thickness (μm) 0.25
Tstart (C) 40.
Tend (C) 240.
Heat rate (K/min) 4.
Initial hold (min) 3.
Final hold (min) 10.
I 1197.
ReferenceKubec, Velísek, et al., 1997
Comment MSDC-RI

Van Den Dool and Kratz RI, non-polar column, temperature ramp

View large format table.

Column type Active phase I Reference Comment
CapillaryBP-51157.Whitfield and Mottram, 20014. K/min; Column length: 50. m; Column diameter: 0.32 mm; Tstart: 60. C; Tend: 250. C
CapillaryBP-51157.Whitfield and Mottram, 1999He, 60. C @ 5. min, 4. K/min; Column length: 50. m; Column diameter: 0.32 mm; Tend: 250. C
CapillaryDB-51145.Madruga and Mottram, 199830. m/0.32 mm/1. μm, 60. C @ 5. min, 4. K/min, 250. C @ 20. min
CapillaryOV-1011123.Misharina, Golovnya, et al., 199250. m/0.31 mm/0.5 μm, He, 4. K/min; Tstart: 50. C; Tend: 250. C
CapillaryDB-11130.Zhang and Ho, 199160. m/0.25 mm/0.25 μm, He, 2. K/min, 220. C @ 10. min; Tstart: 40. C

Normal alkane RI, non-polar column, custom temperature program

View large format table.

Column type Active phase I Reference Comment
CapillarySE-301185.Vinogradov, 2004Program: not specified
CapillaryMethyl Silicone1170.Misharina, 1995Program: not specified
CapillaryMethyl Silicone1174.Misharina, 1995Program: not specified

Normal alkane RI, polar column, temperature ramp

View large format table.

Column type Active phase I Reference Comment
CapillaryHP-Innowax1914.Kubec, Velísek, et al., 199730. m/0.25 mm/0.5 μm, N2, 40. C @ 3. min, 4. K/min; Tend: 190. C

Normal alkane RI, polar column, custom temperature program

View large format table.

Column type Active phase I Reference Comment
CapillaryCarbowax 20M1836.Vinogradov, 2004Program: not specified

References

Weast and Grasselli, 1989
CRC Handbook of Data on Organic Compounds, 2nd Editon, Weast,R.C and Grasselli, J.G., ed(s)., CRC Press, Inc., Boca Raton, FL, 1989, 1. [all data]

Buckingham and Donaghy, 1982
Buckingham, J.; Donaghy, S.M., Dictionary of Organic Compounds: Fifth Edition, Chapman and Hall, New York, 1982, 1. [all data]

Ribeiro da Silva and Santos, 2008
Ribeiro da Silva, Manuel A.V.; Santos, Ana Filipa L.O.M., Experimental thermochemical study of the three methyl substituted 2-acetylthiophene isomers, The Journal of Chemical Thermodynamics, 2008, 40, 8, 1309-1313, https://doi.org/10.1016/j.jct.2008.03.008 . [all data]