Hexanoic acid, 3-trimethylsilyloxy, trimethylsilyl ester

Van Den Dool and Kratz RI, non-polar column, temperature ramp

View large format table.

Column type Active phase I Reference Comment
CapillarySE-521317.Lefevere, Verhaeghe, et al., 198925. m/0.32 mm/0.52 μm, He, 5. K/min; Tstart: 70. C; Tend: 270. C
CapillarySE-521316.Lefevere, Verhaeghe, et al., 198825. m/0.20 mm/0.40 μm, He, 5. K/min; Tstart: 50. C; Tend: 270. C

Normal alkane RI, non-polar column, temperature ramp

View large format table.

Column type Active phase I Reference Comment
CapillaryHP-51317.Isidorov, Kotowska, et al., 200530. m/0.25 mm/0.25 μm, He; Tstart: 50. C; Tend: 300. C

References

Lefevere, Verhaeghe, et al., 1989
Lefevere, M.F.; Verhaeghe, B.J.; Declerck, D.H.; Van Bocxlaer, J.F.; De Leenheer, A.P.; De Sagher, R.M., Metabolic Profiling of Urinary Organic Acids by Single and Multicolumn Capillary Gas Chromatography, J. Chromatogr. Sci., 1989, 27, 1, 23-29, https://doi.org/10.1093/chromsci/27.1.23 . [all data]

Lefevere, Verhaeghe, et al., 1988
Lefevere, M.F.; Verhaeghe, B.J.; Declerck, D.M.; de Leenheer, A.P., Automated profiling of urinary organic acids by dual-column gas chromatography and gas chromatography/mass spectrometry, Biomed. Environ. Mass Spectrom., 1988, 15, 6, 311-322, https://doi.org/10.1002/bms.1200150603 . [all data]

Isidorov, Kotowska, et al., 2005
Isidorov, V.A.; Kotowska, U.; Vinogorova, V.T., GC Identification of organic compounds based on partition coefficients of their TMS derivatives in a hexane-acetonitrile system and retention indices, Anal. Sci., 2005, 21, 12, 1483-1489, https://doi.org/10.2116/analsci.21.1483 . [all data]