2,4,6-Cycloheptatriene-1-carbonitrile

Gas phase ion energetics data

Data compiled by: Sharon G. Lias, Rhoda D. Levin, and Sherif A. Kafafi

Ionization energy determinations

IE (eV) Method Reference
8.89EIVan Der Greef, Molenaar-Langeveld, et al., 1979

Appearance energy determinations

Ion AE (eV) Other Products MethodReferenceComment
C7H6+11.19HCNEIVan Der Greef, Molenaar-Langeveld, et al., 1979

References

Van Der Greef, Molenaar-Langeveld, et al., 1979
Van Der Greef, J.; Molenaar-Langeveld, T.A.; Nibbering, N.M.M., The elimination of HCN (or HNC) from the molecular ions of some isomeric C8H7N compounds, studied by field ionization kinetic and kinetic energy release measurements, Int. J. Mass Spectrom. Ion Phys., 1979, 29, 11. [all data]