phosphonic acid

Vibrational and/or electronic energy levels

Data compiled by: Marilyn E. Jacox

State:   X

Vib.
sym.
 No.   Approximate
 type of mode
 cm-1   Med.   Method   References

OH stretch 3634.8 Ar IR Withnall and Andrews, 1987
PH stretch 2487.5 Ar IR Withnall and Andrews, 1987
P=O stretch 1298.6 Ar IR Withnall and Andrews, 1987
PO2 a-stretch 902.0 Ar IR Withnall and Andrews, 1987
PO2 s-stretch 872.6 Ar IR Withnall and Andrews, 1987

Additional references: Jacox, 1994, page 368

References

Withnall and Andrews, 1987
Withnall, R.; Andrews, L., FTIR spectra of the photolysis products of the phosphine-ozone complex in solid argon, J. Phys. Chem., 1987, 91, 4, 784, https://doi.org/10.1021/j100288a008 . [all data]

Jacox, 1994
Jacox, M.E., Vibrational and electronic energy levels of polyatomic transient molecules, American Chemical Society, Washington, DC, 1994, 464. [all data]