Phenoxazine

Phase change data

Data compiled as indicated in comments:
TRC - Thermodynamics Research Center, NIST Boulder Laboratories, Chris Muzny director
ALS - Hussein Y. Afeefy, Joel F. Liebman, and Stephen E. Stein
AC - William E. Acree, Jr., James S. Chickos

Quantity Value Units Method Reference Comment
Tfus429.85KN/ACullinane and Rees, 1940Uncertainty assigned by TRC = 0.5 K; TRC
Quantity Value Units Method Reference Comment
Δsub96.08 ± 0.31kJ/molCSabbah and El Watik, 1992%hf calculated possible error by author; ALS
Δsub96.1 ± 0.3kJ/molCSabbah and El Watik, 1992AC

In addition to the Thermodynamics Research Center (TRC) data available from this site, much more physical and chemical property data is available from the following TRC products:

Gas phase thermochemistry data

Data compiled by: Hussein Y. Afeefy, Joel F. Liebman, and Stephen E. Stein

Quantity Value Units Method Reference Comment
Δfgas94.0 ± 2.8kJ/molCcrSabbah and El Watik, 1992%hf calculated possible error by author

References

Cullinane and Rees, 1940
Cullinane, N.M.; Rees, W.T., Isomorphous relationships of some organic compounds of analogous constitution, Trans. Faraday Soc., 1940, 36, 507. [all data]

Sabbah and El Watik, 1992
Sabbah, R.; El Watik, L., Etude thermodynamique de la phenoxazine et de la phenotiazine, Thermochim. Acta, 1992, 197, 381-390. [all data]