Naphthalene, 1-ethyl-1,2,3,4-tetrahydro-

Condensed phase thermochemistry data

Data compiled by: Hussein Y. Afeefy, Joel F. Liebman, and Stephen E. Stein

Quantity Value Units Method Reference Comment
Δcliquid-6920.8kJ/molCcbKaro, McLaughlin, et al., 1953Corrected from net heat of combustion; Corresponding Δfliquid = -87.9 kJ/mol (simple calculation by NIST; no Washburn corrections)

References

Karo, McLaughlin, et al., 1953
Karo, W.; McLaughlin, R.L.; Hipsher, H.F., Dicyclic hydrocarbons. VI. 1,2,3,4-Tetrahydronaphthalene and 1-alkyl-1,2,3,4-tetrahydronaphthalenes, J. Am. Chem. Soc., 1953, 75, 3233-3235. [all data]