(Z) 9-(2[1-Naphthyl]ethenyl)acridine

Reaction thermochemistry data

Data compiled by: Hussein Y. Afeefy, Joel F. Liebman, and Stephen E. Stein

Individual Reactions

(Z) 9-(2[1-Naphthyl]ethenyl)acridine = Acridine, 9-[2-(1-naphthalenyl)ethenyl]-, (E)-

By formula: C25H17N = C25H17N

Quantity Value Units Method Reference Comment
Δr-21. ± 0.4kJ/molCmBastianelli, Caia, et al., 1991liquid phase; Thermal Isomerization

References

Bastianelli, Caia, et al., 1991
Bastianelli, C.; Caia, V.; Cum, G.; Gallo, R.; Mancini, V., Thermal isomerization of photochemically synthesized (Z)-9-styrylacridines. An unusually high enthalpy of Z->E conversion for stilbene-like compounds, J. Chem. Soc. Perkin Trans. 2, 1991, 679-683. [all data]