Thieno[2,3-b]thiophene,2-methyl-

Gas phase ion energetics data

Data compiled by: Sharon G. Lias, Rhoda D. Levin, and Sherif A. Kafafi

Ionization energy determinations

IE (eV) Method Reference Comment
8.12PECoustale, Guimon, et al., 1976Vertical value

References

Coustale, Guimon, et al., 1976
Coustale, M.; Guimon, C.; Arriau, J.; Pfister-Guillouzo, G., Spectres photoelectroniques de divers thieno[2,3- b]thiophenes, J. Heterocycl. Chem., 1976, 13, 231. [all data]