2,3-Dimethyl-2,3-bis[(E)phenylazo]butane

Phase change data

Data compiled as indicated in comments:
DRB - Donald R. Burgess, Jr.
AC - William E. Acree, Jr., James S. Chickos

Quantity Value Units Method Reference Comment
Δsub114.4kJ/molN/AEngel, Wang, et al., 1993DRB

Enthalpy of fusion

ΔfusH (kJ/mol) Temperature (K) Reference Comment
21.09342.3Engel, Wang, et al., 1993AC

References

Engel, Wang, et al., 1993
Engel, P.S.; Wang, C.; Chen, Y.; Ruchardt, C.; Beckhaus, H.-D., Synthesis, thermochemistry, and reactions of vicinal bis(azoalkanes). The chemistry α- and β-azo radicals, J. Am. Chem. Soc., 1993, 115, 65-74. [all data]