disodium tetraborate, anhydrous

Condensed phase thermochemistry data

Quantity Value Units Method Reference Comment
Δfliquid-3256.66kJ/molReviewChase, 1998Data last reviewed in March, 1965
Quantity Value Units Method Reference Comment
liquid,1 bar198.77J/mol*KReviewChase, 1998Data last reviewed in March, 1965
Quantity Value Units Method Reference Comment
Δfsolid-3276.75kJ/molReviewChase, 1998Data last reviewed in March, 1965
Quantity Value Units Method Reference Comment
solid189.53J/mol*KReviewChase, 1998Data last reviewed in March, 1965

Liquid Phase Heat Capacity (Shomate Equation)

Cp° = A + B*t + C*t2 + D*t3 + E/t2
H° − H°298.15= A*t + B*t2/2 + C*t3/3 + D*t4/4 − E/t + F − H
S° = A*ln(t) + B*t + C*t2/2 + D*t3/3 − E/(2*t2) + G
    Cp = heat capacity (J/mol*K)
    H° = standard enthalpy (kJ/mol)
    S° = standard entropy (J/mol*K)
    t = temperature (K) / 1000.

View plot Requires a JavaScript / HTML 5 canvas capable browser.

View table.

Temperature (K) 1015.6 - 3000.
A 444.8847
B -2.399395×10-7
C 1.082614×10-7
D -1.624874×10-8
E -3.448900×10-8
F -3476.469
G 550.8780
H -3256.662
ReferenceChase, 1998
Comment Data last reviewed in March, 1965

Solid Phase Heat Capacity (Shomate Equation)

Cp° = A + B*t + C*t2 + D*t3 + E/t2
H° − H°298.15= A*t + B*t2/2 + C*t3/3 + D*t4/4 − E/t + F − H
S° = A*ln(t) + B*t + C*t2/2 + D*t3/3 − E/(2*t2) + G
    Cp = heat capacity (J/mol*K)
    H° = standard enthalpy (kJ/mol)
    S° = standard entropy (J/mol*K)
    t = temperature (K) / 1000.

View plot Requires a JavaScript / HTML 5 canvas capable browser.

View table.

Temperature (K) 298. - 1015.6
A 177.7317
B 150.7792
C -59.95295
D 13.70561
E -2.725467
F -3345.091
G 346.8699
H -3276.746
ReferenceChase, 1998
Comment Data last reviewed in March, 1965

References

Chase, 1998
Chase, M.W., Jr., NIST-JANAF Themochemical Tables, Fourth Edition, J. Phys. Chem. Ref. Data, Monograph 9, 1998, 1-1951. [all data]