Lactic acid, n-tetradecyl ester

Phase change data

Data compiled as indicated in comments:
TRC - Thermodynamics Research Center, NIST Boulder Laboratories, Chris Muzny director
AC - William E. Acree, Jr., James S. Chickos

Quantity Value Units Method Reference Comment
Tfus304.KN/ARehberg and Dixon, 1950Uncertainty assigned by TRC = 2. K; TRC

Enthalpy of vaporization

ΔvapH (kJ/mol) Temperature (K) Method Reference Comment
86.4403.AStephenson and Malanowski, 1987Based on data from 388. - 608. K.; AC

In addition to the Thermodynamics Research Center (TRC) data available from this site, much more physical and chemical property data is available from the following TRC products:

References

Rehberg and Dixon, 1950
Rehberg, C.E.; Dixon, M.B., n-Alkyl Lactates and Their Acetates, J. Am. Chem. Soc., 1950, 72, 1918-22. [all data]

Stephenson and Malanowski, 1987
Stephenson, Richard M.; Malanowski, Stanislaw, Handbook of the Thermodynamics of Organic Compounds, 1987, https://doi.org/10.1007/978-94-009-3173-2 . [all data]