1,2-Benzenedicarboxylic acid, monobutyl ester

Normal alkane RI, non-polar column, temperature ramp

View large format table.

Column type Active phase I Reference Comment
CapillarySPB-51520.Kim and Lee, 200160. m/0.25 mm/0.25 μm, Helium, 50. C @ 3. min, 3. K/min, 240. C @ 10. min

References

Kim and Lee, 2001
Kim, N.-S.; Lee, D.-S., Characterization of Rosemary fragrances by solid phase microextraction and GC-MS, Analyt. Sci., 2001, 17, Supplement, a383-a386. [all data]