Benzenamine, 4-chloro-N-sulfinyl-

Gas phase ion energetics data

Data compiled as indicated in comments:
LBLHLM - Sharon G. Lias, John E. Bartmess, Joel F. Liebman, John L. Holmes, Rhoda D. Levin, and W. Gary Mallard

Ionization energy determinations

IE (eV) Method Reference Comment
8.8PELouwen, Van Dam, et al., 1982LBLHLM
9.10PELouwen, Van Dam, et al., 1982Vertical value; LBLHLM

References

Louwen, Van Dam, et al., 1982
Louwen, J.N.; Van Dam, H.; Stufkens, D.J.; Oskam, A.; Jaffe, H.H., The electronic structures of some aromatic sulfinylamines, J. Electron Spectrosc. Relat. Phenom., 1982, 26, 235. [all data]