thorium dioxide

Vibrational and/or electronic energy levels

Data compiled by: Marilyn E. Jacox

State:   X

Vib.
sym.
 No.   Approximate
 type of mode
 cm-1   Med.   Method   References

a1 1 Sym. stretch 808.4 Ne IR Zhou and Andrews, 1999
1 Sym. stretch 787.3 Ar IR Gabelnick, Reedy, et al., 1974
Kushto and Andrews, 1999
b2 3 Asym. stretch 756.7 Ne IR Zhou and Andrews, 1999
3 Asym. stretch 735.0 Ar IR Gabelnick, Reedy, et al., 1974
Kushto and Andrews, 1999

Additional references: Jacox, 1998, page 179; Jacox, 2003, page 110

Condensed phase thermochemistry data

Quantity Value Units Method Reference Comment
Δfsolid-1226.4 ± 3.5kJ/molReviewCox, Wagman, et al., 1984CODATA Review value
Quantity Value Units Method Reference Comment
solid,1 bar65.23 ± 0.20J/mol*KReviewCox, Wagman, et al., 1984CODATA Review value

References

Zhou and Andrews, 1999
Zhou, M.; Andrews, L., Infrared spectra and pseudopotential calculations for NUO[sup +], NUO, and NThO in solid neon, J. Chem. Phys., 1999, 111, 24, 11044, https://doi.org/10.1063/1.480463 . [all data]

Gabelnick, Reedy, et al., 1974
Gabelnick, S.D.; Reedy, G.T.; Chasanov, M.G., Infrared spectra and structure of some matrix-isolated lanthanide and actinide oxides, J. Chem. Phys., 1974, 60, 3, 1167, https://doi.org/10.1063/1.1681128 . [all data]

Kushto and Andrews, 1999
Kushto, G.P.; Andrews, L., Infrared Spectroscopic and Density Functional Theoretical Investigation of the Reaction Products of Laser-Ablated Zr, Hf, and Th Atoms with Nitric Oxide, J. Phys. Chem. A, 1999, 103, 25, 4836, https://doi.org/10.1021/jp9905732 . [all data]

Jacox, 1998
Jacox, M.E., Vibrational and electronic energy levels of polyatomic transient molecules: supplement A, J. Phys. Chem. Ref. Data, 1998, 27, 2, 115-393, https://doi.org/10.1063/1.556017 . [all data]

Jacox, 2003
Jacox, M.E., Vibrational and electronic energy levels of polyatomic transient molecules: supplement B, J. Phys. Chem. Ref. Data, 2003, 32, 1, 1-441, https://doi.org/10.1063/1.1497629 . [all data]