disodium peroxide

Vibrational and/or electronic energy levels

Data compiled by: Marilyn E. Jacox

State:   X

Vib.
sym.
 No.   Approximate
 type of mode
 cm-1   Med.   Method   References

b1u 4 239.0 Ar IR Andrews, 1969
b2u 5 524.5 Ar IR Andrews, 1969
b3u 6 254.0 Ar IR Andrews, 1969

References

Andrews, 1969
Andrews, L., Infrared spectra and bonding in the sodium superoxide and sodium peroxide molecules, J. Phys. Chem., 1969, 73, 11, 3922, https://doi.org/10.1021/j100845a061 . [all data]