1,2-Diethoxy-4-ethylbenzene

Kovats' RI, non-polar column, isothermal

View large format table.

Column type Active phase Temperature (C) I Reference Comment
CapillaryOV-1110.1327.Hazai and Ledniczky, 1990H2; Column length: 20. m; Column diameter: 0.25 mm

References

Hazai and Ledniczky, 1990
Hazai, I.; Ledniczky, L., Gas chromatographic-mass spectrometric identification of impurities in 1,2-diethoxybenzene, J. Chromatogr., 1990, 520, 149-155, https://doi.org/10.1016/0021-9673(90)85095-D . [all data]