diindium trioxide

Vibrational and/or electronic energy levels

Data compiled by: Marilyn E. Jacox

State:   X

Vib.
sym.
 No.   Approximate
 type of mode
 cm-1   Med.   Method   References

826 Ar IR Burkholder, Yustein, et al., 1992

Additional references: Jacox, 1994, page 283

References

Burkholder, Yustein, et al., 1992
Burkholder, T.R.; Yustein, J.T.; Andrews, L., Reactions of pulsed laser evaporated gallium and indium atoms with molecular oxygen: matrix infrared spectra of new gallium dioxide and indium dioxide species, J. Phys. Chem., 1992, 96, 25, 10189, https://doi.org/10.1021/j100204a019 . [all data]

Jacox, 1994
Jacox, M.E., Vibrational and electronic energy levels of polyatomic transient molecules, American Chemical Society, Washington, DC, 1994, 464. [all data]