Phenol, 2-methyl-6-nitro-

Kovats' RI, non-polar column, isothermal

View large format table.

Column type Active phase Temperature (C) I Reference Comment
PackedSE-30204.1270.Mitchell and Vernon, 1972
PackedApiezon L204.1318.Mitchell and Vernon, 1972
PackedSE-52204.1305.Mitchell and Vernon, 1972

References

Mitchell and Vernon, 1972
Mitchell, P.T.; Vernon, F., Gas-Liquid Chromatography of Nitrophenols and Methyl Derivatives, J. Chromatogr., 1972, 65, 3, 487-491, https://doi.org/10.1016/S0021-9673(00)84994-8 . [all data]