3,3'-Diethylbiphenyl

Reaction thermochemistry data

Data compiled by: Hussein Y. Afeefy, Joel F. Liebman, and Stephen E. Stein

Individual Reactions

3,5-Diethylbiphenyl = 3,3'-Diethylbiphenyl

By formula: C16H18 = C16H18

Quantity Value Units Method Reference Comment
Δr-0.1kJ/molEqkRoshchupkina, Nesterova, et al., 1987liquid phase; T=387.7 K

3,3'-Diethylbiphenyl = Biphenyl, 3,4'-diethyl-

By formula: C16H18 = C16H18

Quantity Value Units Method Reference Comment
Δr-0.37kJ/molEqkRoshchupkina, Nesterova, et al., 1987liquid phase; T=388.3 K

References

Roshchupkina, Nesterova, et al., 1987
Roshchupkina, I.Yu.; Nesterova, T.N.; Rozhnov, A.M., Equilibria of isomeric transformations of alkylbiphenyls, J. Chem. Thermodyn., 1987, 19, 299-306. [all data]