N,2,4,6-Tetramethylbenzenamine

Gas phase ion energetics data

Data compiled as indicated in comments:
LLK - Sharon G. Lias, Rhoda D. Levin, and Sherif A. Kafafi

Ionization energy determinations

IE (eV) Method Reference Comment
7.22PECowling and Johnstone, 1973LLK

References

Cowling and Johnstone, 1973
Cowling, S.A.; Johnstone, R.A.W., Photoelectron spectroscopy: The effects of steric inhibition to resonance in anilines, J. Electron Spectrosc. Relat. Phenom., 1973, 2, 161. [all data]