Bicyclo[3.1.1]hept-2-ene-2-ethanol, 6,6-dimethyl-

Van Den Dool and Kratz RI, non-polar column, temperature ramp

View large format table.

Column type Active phase I Reference Comment
CapillaryHP-5MS1212.Saroglou, Dorizas, et al., 200630. m/0.25 mm/0.25 μm, He, 60. C @ 5. min, 4. K/min; Tend: 280. C

Normal alkane RI, non-polar column, temperature ramp

View large format table.

Column type Active phase I Reference Comment
CapillaryUltra 21191.Byun and Shin, 200850. m/0.20 mm/0.11 μm, Helium, 60. C @ 5. min, 2. K/min, 230. C @ 30. min

Normal alkane RI, polar column, temperature ramp

View large format table.

Column type Active phase I Reference Comment
CapillaryDB-Wax1827.Qian and Wang, 200560. m/0.32 mm/0.50 μm, Nitrogen, 35. C @ 4. min, 2. K/min, 235. C @ 30. min

References

Saroglou, Dorizas, et al., 2006
Saroglou, V.; Dorizas, N.; Kypriotakis, Z.; Skaltsa, H.D., Analysis of the essential oil composition of eight Anthemis species from Greece, J. Chromatogr. A, 2006, 1104, 1-2, 313-322, https://doi.org/10.1016/j.chroma.2005.11.087 . [all data]

Byun and Shin, 2008
Byun, Y.; Shin, S., Analysis of compounds and activity of essential oil from Chrysanthemum zawadskii var. latilobum and C. indicum agaunst antibiotic-resistant pathogenic bacteria, Nat. Prod. Sci., 2008, 14, 2, 138-142. [all data]

Qian and Wang, 2005
Qian, M.C.; Wang, Y., Seasonal Variations of Volatile Composition and Odor Activity Value of Marion (Rubus spp. hyb) and Thornless Evergreen (R.laciniatus L.) Blackberries, J. Food. Sci., 2005, 70, 1, c13-c20, https://doi.org/10.1111/j.1365-2621.2005.tb09013.x . [all data]