Selenium hexamer

Gas phase ion energetics data

Data compiled as indicated in comments:
LLK - Sharon G. Lias, Rhoda D. Levin, and Sherif A. Kafafi
RDSH - Henry M. Rosenstock, Keith Draxl, Bruce W. Steiner, and John T. Herron

Ionization energy determinations

IE (eV) Method Reference Comment
8.23 ± 0.05PEStreets and Berkowitz, 1976LLK
9.08 ± 0.05EIFujisaki, Westmore, et al., 1966RDSH
8.9 ± 0.2EIBerkowitz and Chupka, 1966RDSH

References

Streets and Berkowitz, 1976
Streets, D.G.; Berkowitz, J., Photoelectron spectroscopy of Se2 and Te2, J. Electron Spectrosc. Relat. Phenom., 1976, 9, 269. [all data]

Fujisaki, Westmore, et al., 1966
Fujisaki, H.; Westmore, J.B.; Tickner, A.W., Mass spectrometric study of subliming selenium, Can. J. Chem., 1966, 44, 3063. [all data]

Berkowitz and Chupka, 1966
Berkowitz, J.; Chupka, W.A., Equilibrium composition of selenium vapor; the thermodynamics of the vaporization of HgSe, CdSe, and SrSe, J. Chem. Phys., 1966, 45, 4289. [all data]