Hexakis[(4-hexylphenyl)ethynyl]benzene

Phase change data

Data compiled by: Eugene S. Domalski and Elizabeth D. Hearing

Enthalpy of fusion

ΔfusH (kJ/mol) Temperature (K) Reference Comment
38.900397.55Praefcke, Kohne, et al., 1990Crystal/nematic-discotic.

Enthalpy of phase transition

ΔHtrs (kJ/mol) Temperature (K) Initial Phase Final Phase Reference Comment
0.200416.05liquid, Nematicliquid, discotic/isotropicPraefcke, Kohne, et al., 1990

References

Praefcke, Kohne, et al., 1990
Praefcke, K.; Kohne, B.; Singer, D., Hexaalkynyltriphenylene as new type of nematic-discotic hydrocarbon, Angew Chem., 1990, 102(2), 200-202. [all data]