2-Propanol, 1-(2-butoxyethoxy)-

Normal alkane RI, non-polar column, isothermal

View large format table.

Column type Active phase Temperature (C) I Reference Comment
PackedDC-400150.890.Anderson, 1968Helium, Gas-Pak (60-80 mesh); Column length: 3.0 m

References

Anderson, 1968
Anderson, D.G., USe of Kovats retention indices and response factors for the qualitative and quantitative analysis of coating solvents, J. Paint Technol., 1968, 40, 527, 549-557. [all data]