Disodium diiodide

Gas phase ion energetics data

Data compiled by: Henry M. Rosenstock, Keith Draxl, Bruce W. Steiner, and John T. Herron

Ionization energy determinations

IE (eV) Method Reference
7.64PIBerkowitz and Chupka, 1966

Appearance energy determinations

Ion AE (eV) Other Products MethodReferenceComment
Na2I+~7.80 ± 0.05IPIBerkowitz and Chupka, 1966
Na2I+9.1 ± 0.3IEIPlatel, 1965

References

Berkowitz and Chupka, 1966
Berkowitz, J.; Chupka, W.A., Photoionization of high-temperature vapors. I. The iodides of sodium, magnesium, and thallium, J. Chem. Phys., 1966, 45, 1287. [all data]

Platel, 1965
Platel, G., Mesures des potentials d'apparition des ions obtenus par impact electronique dans la phase vapeur des iodures alcalins et des melanges LiI-MI, J. Chim. Phys., 1965, 62, 1176. [all data]