Acetic acid, phenoxy-

Gas phase ion energetics data

Data compiled by: John E. Bartmess

De-protonation reactions

C8H7O3- + Hydrogen cation = Acetic acid, phenoxy-

By formula: C8H7O3- + H+ = C8H8O3

Quantity Value Units Method Reference Comment
Δr1414. ± 9.2kJ/molG+TSCaldwell, Renneboog, et al., 1989gas phase
Quantity Value Units Method Reference Comment
Δr1385. ± 8.4kJ/molIMRECaldwell, Renneboog, et al., 1989gas phase

References

Caldwell, Renneboog, et al., 1989
Caldwell, G.; Renneboog, R.; Kebarle, P., Gas Phase Acidities of Aliphatic Carboxylic Acids, Based on Measurements of Proton Transfer Equilibria, Can. J. Chem., 1989, 67, 4, 661, https://doi.org/10.1139/v89-092 . [all data]