Triolein

Reaction thermochemistry data

Data compiled by: Hussein Y. Afeefy, Joel F. Liebman, and Stephen E. Stein

Individual Reactions

Triolein + 3Hydrogen = Tristearin

By formula: C57H104O6 + 3H2 = C57H110O6

Quantity Value Units Method Reference Comment
Δr-1592.2kJ/molChydRogers and Choudhury, 1978liquid phase; solvent: Hexane

Condensed phase thermochemistry data

Data compiled by: Hussein Y. Afeefy, Joel F. Liebman, and Stephen E. Stein

Quantity Value Units Method Reference Comment
Δcliquid-8389.00 ± 0.31kcal/molCcbFreedman, Bagby, et al., 1989Corresponding Δfliquid = -524.30 kcal/mol (simple calculation by NIST; no Washburn corrections)

References

Rogers and Choudhury, 1978
Rogers, D.W.; Choudhury, D.N., Heats of hydrogenation of large molecules. Part 3 - Five simple unsaturated triglycerides (triacylglycerols), J. Chem. Soc. Faraday Trans. 1, 1978, 74, 2868-2872. [all data]