H2F+

Reaction thermochemistry data

Data compiled by: Michael M. Meot-Ner (Mautner) and Sharon G. Lias

Individual Reactions

(H2F+ • hydrogen fluoride) + hydrogen fluoride = (H2F+ • 2hydrogen fluoride)

By formula: (H2F+ • HF) + HF = (H2F+ • 2HF)

Quantity Value Units Method Reference Comment
Δr62. ± 18.kJ/molPITiedemann, Anderson, et al., 1979gas phase

H2F+ + hydrogen fluoride = (H2F+ • hydrogen fluoride)

By formula: H2F+ + HF = (H2F+ • HF)

Quantity Value Units Method Reference Comment
Δr105. ± 10.kJ/molPITiedemann, Anderson, et al., 1979gas phase

References

Tiedemann, Anderson, et al., 1979
Tiedemann, P.W.; Anderson, S.L.; Ceyer, S.T.; Hirooka, T.; Ng, C.Y.; Mahan, B.H.; Lee, Y.T., Proton affinities of hydrogen halides determined by the molecular beam photoionization method, J. Chem. Phys., 1979, 71, 605. [all data]