Nickel, di-μ-carbonylbis(η5-2,4-cyclopentadien-1-yl)di-, (Ni-Ni)

Gas phase ion energetics data

Data compiled as indicated in comments:
LBLHLM - Sharon G. Lias, John E. Bartmess, Joel F. Liebman, John L. Holmes, Rhoda D. Levin, and W. Gary Mallard
LLK - Sharon G. Lias, Rhoda D. Levin, and Sherif A. Kafafi

Ionization energy determinations

IE (eV) Method Reference Comment
6.6PEGranozzi, Casarin, et al., 1982LBLHLM
7.05 ± 0.02EIEfraty, Huang, et al., 1977LLK
6.97PEGranozzi, Casarin, et al., 1982Vertical value; LBLHLM

Appearance energy determinations

Ion AE (eV) Other Products MethodReferenceComment
C5H5Ni+13.66 ± 0.03?EIEfraty, Huang, et al., 1977LLK
C10H10Ni+7.33 ± 0.022CO+NiEIEfraty, Huang, et al., 1977LLK
C10H10Ni2+9.05 ± 0.022COEIEfraty, Huang, et al., 1977LLK
C11H10Ni2O+7.87 ± 0.05COEIEfraty, Huang, et al., 1977LLK

References

Granozzi, Casarin, et al., 1982
Granozzi, G.; Casarin, M.; Ajo, D.; Osella, D., Electron structure of [missing note2] by He(I) and He(II) photoelectron spectroscopy, J. Chem. Soc. Dalton Trans., 1982, 2047. [all data]

Efraty, Huang, et al., 1977
Efraty, A.; Huang, M.H.A.; Weston, C.A., Mass spectra of organometallic compounds. 4. Electron-impact study of some cyclopentadienylmetal carbonyl dimers, Inorg. Chem., 1977, 16, 79. [all data]